{"text_format":"1","workbook":"xlsx","n_sheets":58,"sheets":["INSTRUCCIONES","User01","User02","User03","User04","User05","User06","User07","User08","User09","User10","User11","User12","User13","User14","User15","User16","User17","User18","User19","User20","User21","User22","User23","User24","User25","User26","User27","User28","User29","User30","User31","User32","User33","User34","User35","User36","User37","User38","User39","User40","User41","User42","User43","User44","User45","User46","User47","User48","User49","User50","ItemA","ItemB","ItemC","ItemD","ItemE","ItemF","COMPARATIVA ENTRE PRODUCTOS"],"not_rendered":{"charts":332,"images":1,"macros":1,"external_links":0,"defined_names":251,"comments":0,"pivot_tables":0},"unopened":[],"bounds":{"document_bytes":16777216,"sheet_cells":100000,"rows_first":2000,"rows_last":500,"rows_between":2000,"halvings":0,"cell_chars":16384,"cell_head_chars":4096},"cells_cut":0,"cells_raw":0,"read":"whole","date_system":"1900"}

{"sheet":"INSTRUCCIONES","index":0,"n_rows":30,"n_cols":2,"rows_kept":30,"cut":false,"hidden":false,"merged":[[3,1,13,16],[15,1,27,16],[29,1,40,16]]}
[]
[null,"VALORACION DE EMOCIONES"]
[]
[null,"Los entrevistadores deberán preparar el archivo con las emociones que se desea evaluar (es el único aspecto modificable del archivo excel) para lo cual deberán escribirlas en el item A del usuario 01, con ello cambiarán las emociones de todos los usuarios, tablas y gráficos en adelante."]
[]
[]
[]
[]
[]
[]
[]
[]
[]
[]
[]
[null,"Los usuarios, uno a uno y guiados por los entrevistadores, deberán ir completando las pestañas correspondientes a cada uno. Los resultados serán calculados automáticamente por ítem y  comparativamente entre ellos (7 hojas finales del archivo excel). No es necesario que sean encuestados los 50 usuarios o que se comparen los 6 items necesariamente, los resultados se calcularán en base a la cantidad de usuarios entrevistados y los items comparados, no obstante para efectos de validez de la muestra se recomienda que idealmente si se entreviste a 50 personas."]
[]
[]
[]
[]
[]
[]
[]
[]
[]
[]
[]
[]
[]
[null,"Los entrevistadores podrán posteriormente desproteger la hoja de comparativa entre los productos para copiar los resultados y tablas en otros documentos."]

{"sheet":"User01","index":1,"n_rows":112,"n_cols":13,"rows_kept":112,"cut":false,"hidden":false,"merged":[[62,1,63,1],[62,7,63,7],[80,1,81,1],[80,7,81,7],[98,1,99,1],[98,7,99,7],[0,1,0,17],[2,13,5,17],[27,7,28,7],[44,7,45,7],[10,7,11,7],[10,1,11,1],[27,1,28,1],[44,1,45,1]]}
[null,"ESTAS TABLAS UTILIZAN MACROS DE EXCEL, POR LO TANTO CUANDO SE LE CONSULTE AL ABRIR EL ARCHIVO DEBE ACEPTAR Y HABILITAR LAS MACROS PARA QUE FUNCIONEN CORRECTAMENTE"]
[]
[null,"VALORACIÓN EMOCIONAL DE PRODUCTOS, MATERIALES O SERVICIOS",null,null,null,null,null,null,"GÉNERO:",null,"EDAD:",null,"OBS:"]
[]
[null,"DÍGANOS COMO SE SIENTE RESPECTO A CADA PRODUCTO, MATERIAL O SERVICIO"]
[null,"· ESCOJA ENTRE 3 Y 5 EMOCIONES QUE UD. EXPERIMENTE CON MAYOR INTENSIDAD"]
[null,"· MARQUE CON UNA X LAS EMOCIONES Y LOS NIVELES DE INTENSIDAD ESCOGIDOS"]
[null,"· MARQUE SUS PREFERENCIAS CON UN DOBLE CLIC EN LA CELDA ESCOGIDA (PUEDE BORRAR DEL MISMO MODO)"]
[]
[]
[null,"EMOCIONES \\ INTENSIDAD","NADA","POCO","MEDIANAMENTE","BASTANTE","MUCHO","VALORACIÓN"]
[null,null,1.00000000001,2,3,4,5]
[null,"ALEGRÍA",null,null,null,null,null,{"$f":"IF((SUMIF(C13:G13,\"X\",$C$12:$G$12)),(SUMIF(C13:G13,\"X\",$C$12:$G$12)), 1)","v":1}]
[null,"SATISFACCIÓN",null,null,null,null,null,{"$f":"IF((SUMIF(C14:G14,\"X\",$C$12:$G$12)),(SUMIF(C14:G14,\"X\",$C$12:$G$12)), 1)","v":1}]
[null,"FASCINACIÓN",null,null,null,null,null,1]
[null,"ABURRIMIENTO",null,null,null,null,null,1]
[null,"ENFADO",null,null,null,null,null,1]
[null,"TRISTEZA",null,null,null,null,null,1]
[null,"VERGÜENZA",null,null,null,null,null,1]
[null,"MIEDO",null,null,null,null,null,1]
[null,"REPUGNANCIA",null,null,null,null,null,1]
[null,"DESEO",null,null,null,null,null,1]
[null,"ESPERANZA",null,null,null,null,null,1]
[null,"ORGULLO",null,null,null,null,null,1]
[]
[]
[]
[null,"EMOCIONES \\ INTENSIDAD","NADA","POCO","MEDIANAMENTE","BASTANTE","MUCHO","VALORACIÓN"]
[null,null,1.00000000001,2,3,4,5]
[null,{"$f":"$B13","v":"ALEGRÍA"},null,null,null,null,null,{"$f":"IF((SUMIF(C30:G30,\"X\",$C$29:$G$29)),(SUMIF(C30:G30,\"X\",$C$29:$G$29)), 1)","v":1}]
[null,"SATISFACCIÓN",null,null,null,null,null,{"$f":"IF((SUMIF(C31:G31,\"X\",$C$29:$G$29)),(SUMIF(C31:G31,\"X\",$C$29:$G$29)), 1)","v":1}]
[null,"FASCINACIÓN",null,null,null,null,null,1]
[null,"ABURRIMIENTO",null,null,null,null,null,1]
[null,"ENFADO",null,null,null,null,null,1]
[null,"TRISTEZA",null,null,null,null,null,1]
[null,"VERGÜENZA",null,null,null,null,null,1]
[null,"MIEDO",null,null,null,null,null,1]
[null,"REPUGNANCIA",null,null,null,null,null,1]
[null,"DESEO",null,null,null,null,null,1]
[null,"ESPERANZA",null,null,null,null,null,1]
[null,"ORGULLO",null,null,null,null,null,1]
[]
[]
[]
[null,"EMOCIONES \\ INTENSIDAD","NADA","POCO","MEDIANAMENTE","BASTANTE","MUCHO","VALORACIÓN"]
[null,null,1.00000000001,2,3,4,5]
[null,{"$f":"$B30","v":"ALEGRÍA"},null,null,null,null,null,{"$f":"IF((SUMIF(C47:G47,\"X\",$C$46:$G$46)),(SUMIF(C47:G47,\"X\",$C$46:$G$46)), 1)","v":1}]
[null,"SATISFACCIÓN",null,null,null,null,null,{"$f":"IF((SUMIF(C48:G48,\"X\",$C$46:$G$46)),(SUMIF(C48:G48,\"X\",$C$46:$G$46)), 1)","v":1}]
[null,"FASCINACIÓN",null,null,null,null,null,1]
[null,"ABURRIMIENTO",null,null,null,null,null,1]
[null,"ENFADO",null,null,null,null,null,1]
[null,"TRISTEZA",null,null,null,null,null,1]
[null,"VERGÜENZA",null,null,null,null,null,1]
[null,"MIEDO",null,null,null,null,null,1]
[null,"REPUGNANCIA",null,null,null,null,null,1]
[null,"DESEO",null,null,null,null,null,1]
[null,"ESPERANZA",null,null,null,null,null,1]
[null,"ORGULLO",null,null,null,null,null,1]
[]
[]
[]
[]
[null,"EMOCIONES \\ INTENSIDAD","NADA","POCO","MEDIANAMENTE","BASTANTE","MUCHO","VALORACIÓN"]
[null,null,1.00000000001,2,3,4,5]
[null,{"$f":"$B47","v":"ALEGRÍA"},null,null,null,null,null,{"$f":"IF((SUMIF(C65:G65,\"X\",$C$64:$G$64)),(SUMIF(C65:G65,\"X\",$C$64:$G$64)), 1)","v":1}]
[null,"SATISFACCIÓN",null,null,null,null,null,{"$f":"IF((SUMIF(C66:G66,\"X\",$C$64:$G$64)),(SUMIF(C66:G66,\"X\",$C$64:$G$64)), 1)","v":1}]
[null,"FASCINACIÓN",null,null,null,null,null,1]
[null,"ABURRIMIENTO",null,null,null,null,null,1]
[null,"ENFADO",null,null,null,null,null,1]
[null,"TRISTEZA",null,null,null,null,null,1]
[null,"VERGÜENZA",null,null,null,null,null,1]
[null,"MIEDO",null,null,null,null,null,1]
[null,"REPUGNANCIA",null,null,null,null,null,1]
[null,"DESEO",null,null,null,null,null,1]
[null,"ESPERANZA",null,null,null,null,null,1]
[null,"ORGULLO",null,null,null,null,null,1]
[]
[]
[]
[]
[null,"EMOCIONES \\ INTENSIDAD","NADA","POCO","MEDIANAMENTE","BASTANTE","MUCHO","VALORACIÓN"]
[null,null,1.00000000001,2,3,4,5]
[null,{"$f":"$B65","v":"ALEGRÍA"},null,null,null,null,null,{"$f":"IF((SUMIF(C83:G83,\"X\",$C$82:$G$82)),(SUMIF(C83:G83,\"X\",$C$82:$G$82)), 1)","v":1}]
[null,"SATISFACCIÓN",null,null,null,null,null,{"$f":"IF((SUMIF(C84:G84,\"X\",$C$82:$G$82)),(SUMIF(C84:G84,\"X\",$C$82:$G$82)), 1)","v":1}]
[null,"FASCINACIÓN",null,null,null,null,null,1]
[null,"ABURRIMIENTO",null,null,null,null,null,1]
[null,"ENFADO",null,null,null,null,null,1]
[null,"TRISTEZA",null,null,null,null,null,1]
[null,"VERGÜENZA",null,null,null,null,null,1]
[null,"MIEDO",null,null,null,null,null,1]
[null,"REPUGNANCIA",null,null,null,null,null,1]
[null,"DESEO",null,null,null,null,null,1]
[null,"ESPERANZA",null,null,null,null,null,1]
[null,"ORGULLO",null,null,null,null,null,1]
[]
[]
[]
[]
[null,"EMOCIONES \\ INTENSIDAD","NADA","POCO","MEDIANAMENTE","BASTANTE","MUCHO","VALORACIÓN"]
[null,null,1.00000000001,2,3,4,5]
[null,{"$f":"$B83","v":"ALEGRÍA"},null,null,null,null,null,{"$f":"IF((SUMIF(C101:G101,\"X\",$C$100:$G$100)),(SUMIF(C101:G101,\"X\",$C$100:$G$100)), 1)","v":1}]
[null,"SATISFACCIÓN",null,null,null,null,null,{"$f":"IF((SUMIF(C102:G102,\"X\",$C$100:$G$100)),(SUMIF(C102:G102,\"X\",$C$100:$G$100)), 1)","v":1}]
[null,"FASCINACIÓN",null,null,null,null,null,1]
[null,"ABURRIMIENTO",null,null,null,null,null,1]
[null,"ENFADO",null,null,null,null,null,1]
[null,"TRISTEZA",null,null,null,null,null,1]
[null,"VERGÜENZA",null,null,null,null,null,1]
[null,"MIEDO",null,null,null,null,null,1]
[null,"REPUGNANCIA",null,null,null,null,null,1]
[null,"DESEO",null,null,null,null,null,1]
[null,"ESPERANZA",null,null,null,null,null,1]
[null,"ORGULLO",null,null,null,null,null,1]

{"sheet":"User02","index":2,"n_rows":112,"n_cols":13,"rows_kept":112,"cut":false,"hidden":false,"merged":[[98,1,99,1],[98,7,99,7],[44,1,45,1],[44,7,45,7],[62,1,63,1],[62,7,63,7],[80,1,81,1],[80,7,81,7],[0,1,0,17],[2,13,5,17],[10,1,11,1],[10,7,11,7],[27,1,28,1],[27,7,28,7]]}
[null,"ESTAS TABLAS UTILIZAN MACROS DE EXCEL, POR LO TANTO CUANDO SE LE CONSULTE AL ABRIR EL ARCHIVO DEBE ACEPTAR Y HABILITAR LAS MACROS PARA QUE FUNCIONEN CORRECTAMENTE"]
[]
[null,"VALORACIÓN EMOCIONAL DE PRODUCTOS, MATERIALES O SERVICIOS",null,null,null,null,null,null,"GÉNERO:",null,"EDAD:",null,"OBS:"]
[]
[null,"DÍGANOS COMO SE SIENTE RESPECTO A CADA PRODUCTO, MATERIAL O SERVICIO"]
[null,"· ESCOJA ENTRE 3 Y 5 EMOCIONES QUE UD. EXPERIMENTE CON MAYOR INTENSIDAD"]
[null,"· MARQUE CON UNA X LAS EMOCIONES Y LOS NIVELES DE INTENSIDAD ESCOGIDOS"]
[null,"· MARQUE SUS PREFERENCIAS CON UN DOBLE CLIC EN LA CELDA ESCOGIDA (PUEDE BORRAR DEL MISMO MODO)"]
[]
[]
[null,"EMOCIONES \\ INTENSIDAD","NADA","POCO","MEDIANAMENTE","BASTANTE","MUCHO","VALORACIÓN"]
[null,null,1.00000000001,2,3,4,5]
[null,{"$f":"User01!B13","v":"ALEGRÍA"},null,null,null,null,null,{"$f":"IF((SUMIF(C13:G13,\"X\",$C$12:$G$12)),(SUMIF(C13:G13,\"X\",$C$12:$G$12)), 1)","v":1}]
[null,{"$f":"User01!B14","v":"SATISFACCIÓN"},null,null,null,null,null,{"$f":"IF((SUMIF(C14:G14,\"X\",$C$12:$G$12)),(SUMIF(C14:G14,\"X\",$C$12:$G$12)), 1)","v":1}]
[null,{"$f":"User01!B15","v":"FASCINACIÓN"},null,null,null,null,null,1]
[null,{"$f":"User01!B16","v":"ABURRIMIENTO"},null,null,null,null,null,1]
[null,{"$f":"User01!B17","v":"ENFADO"},null,null,null,null,null,1]
[null,{"$f":"User01!B18","v":"TRISTEZA"},null,null,null,null,null,1]
[null,{"$f":"User01!B19","v":"VERGÜENZA"},null,null,null,null,null,1]
[null,{"$f":"User01!B20","v":"MIEDO"},null,null,null,null,null,1]
[null,{"$f":"User01!B21","v":"REPUGNANCIA"},null,null,null,null,null,1]
[null,{"$f":"User01!B22","v":"DESEO"},null,null,null,null,null,1]
[null,{"$f":"User01!B23","v":"ESPERANZA"},null,null,null,null,null,1]
[null,{"$f":"User01!B24","v":"ORGULLO"},null,null,null,null,null,1]
[]
[]
[]
[null,"EMOCIONES \\ INTENSIDAD","NADA","POCO","MEDIANAMENTE","BASTANTE","MUCHO","VALORACIÓN"]
[null,null,1.00000000001,2,3,4,5]
[null,{"$f":"$B13","v":"ALEGRÍA"},null,null,null,null,null,{"$f":"IF((SUMIF(C30:G30,\"X\",$C$29:$G$29)),(SUMIF(C30:G30,\"X\",$C$29:$G$29)), 1)","v":1}]
[null,"SATISFACCIÓN",null,null,null,null,null,{"$f":"IF((SUMIF(C31:G31,\"X\",$C$29:$G$29)),(SUMIF(C31:G31,\"X\",$C$29:$G$29)), 1)","v":1}]
[null,"FASCINACIÓN",null,null,null,null,null,1]
[null,"ABURRIMIENTO",null,null,null,null,null,1]
[null,"ENFADO",null,null,null,null,null,1]
[null,"TRISTEZA",null,null,null,null,null,1]
[null,"VERGÜENZA",null,null,null,null,null,1]
[null,"MIEDO",null,null,null,null,null,1]
[null,"REPUGNANCIA",null,null,null,null,null,1]
[null,"DESEO",null,null,null,null,null,1]
[null,"ESPERANZA",null,null,null,null,null,1]
[null,"ORGULLO",null,null,null,null,null,1]
[]
[]
[]
[null,"EMOCIONES \\ INTENSIDAD","NADA","POCO","MEDIANAMENTE","BASTANTE","MUCHO","VALORACIÓN"]
[null,null,1.00000000001,2,3,4,5]
[null,{"$f":"$B30","v":"ALEGRÍA"},null,null,null,null,null,{"$f":"IF((SUMIF(C47:G47,\"X\",$C$46:$G$46)),(SUMIF(C47:G47,\"X\",$C$46:$G$46)), 1)","v":1}]
[null,"SATISFACCIÓN",null,null,null,null,null,{"$f":"IF((SUMIF(C48:G48,\"X\",$C$46:$G$46)),(SUMIF(C48:G48,\"X\",$C$46:$G$46)), 1)","v":1}]
[null,"FASCINACIÓN",null,null,null,null,null,1]
[null,"ABURRIMIENTO",null,null,null,null,null,1]
[null,"ENFADO",null,null,null,null,null,1]
[null,"TRISTEZA",null,null,null,null,null,1]
[null,"VERGÜENZA",null,null,null,null,null,1]
[null,"MIEDO",null,null,null,null,null,1]
[null,"REPUGNANCIA",null,null,null,null,null,1]
[null,"DESEO",null,null,null,null,null,1]
[null,"ESPERANZA",null,null,null,null,null,1]
[null,"ORGULLO",null,null,null,null,null,1]
[]
[]
[]
[]
[null,"EMOCIONES \\ INTENSIDAD","NADA","POCO","MEDIANAMENTE","BASTANTE","MUCHO","VALORACIÓN"]
[null,null,1.00000000001,2,3,4,5]
[null,{"$f":"$B47","v":"ALEGRÍA"},null,null,null,null,null,{"$f":"IF((SUMIF(C65:G65,\"X\",$C$64:$G$64)),(SUMIF(C65:G65,\"X\",$C$64:$G$64)), 1)","v":1}]
[null,"SATISFACCIÓN",null,null,null,null,null,{"$f":"IF((SUMIF(C66:G66,\"X\",$C$64:$G$64)),(SUMIF(C66:G66,\"X\",$C$64:$G$64)), 1)","v":1}]
[null,"FASCINACIÓN",null,null,null,null,null,1]
[null,"ABURRIMIENTO",null,null,null,null,null,1]
[null,"ENFADO",null,null,null,null,null,1]
[null,"TRISTEZA",null,null,null,null,null,1]
[null,"VERGÜENZA",null,null,null,null,null,1]
[null,"MIEDO",null,null,null,null,null,1]
[null,"REPUGNANCIA",null,null,null,null,null,1]
[null,"DESEO",null,null,null,null,null,1]
[null,"ESPERANZA",null,null,null,null,null,1]
[null,"ORGULLO",null,null,null,null,null,1]
[]
[]
[]
[]
[null,"EMOCIONES \\ INTENSIDAD","NADA","POCO","MEDIANAMENTE","BASTANTE","MUCHO","VALORACIÓN"]
[null,null,1.00000000001,2,3,4,5]
[null,{"$f":"$B65","v":"ALEGRÍA"},null,null,null,null,null,{"$f":"IF((SUMIF(C83:G83,\"X\",$C$82:$G$82)),(SUMIF(C83:G83,\"X\",$C$82:$G$82)), 1)","v":1}]
[null,"SATISFACCIÓN",null,null,null,null,null,{"$f":"IF((SUMIF(C84:G84,\"X\",$C$82:$G$82)),(SUMIF(C84:G84,\"X\",$C$82:$G$82)), 1)","v":1}]
[null,"FASCINACIÓN",null,null,null,null,null,1]
[null,"ABURRIMIENTO",null,null,null,null,null,1]
[null,"ENFADO",null,null,null,null,null,1]
[null,"TRISTEZA",null,null,null,null,null,1]
[null,"VERGÜENZA",null,null,null,null,null,1]
[null,"MIEDO",null,null,null,null,null,1]
[null,"REPUGNANCIA",null,null,null,null,null,1]
[null,"DESEO",null,null,null,null,null,1]
[null,"ESPERANZA",null,null,null,null,null,1]
[null,"ORGULLO",null,null,null,null,null,1]
[]
[]
[]
[]
[null,"EMOCIONES \\ INTENSIDAD","NADA","POCO","MEDIANAMENTE","BASTANTE","MUCHO","VALORACIÓN"]
[null,null,1.00000000001,2,3,4,5]
[null,{"$f":"$B83","v":"ALEGRÍA"},null,null,null,null,null,{"$f":"IF((SUMIF(C101:G101,\"X\",$C$100:$G$100)),(SUMIF(C101:G101,\"X\",$C$100:$G$100)), 1)","v":1}]
[null,"SATISFACCIÓN",null,null,null,null,null,{"$f":"IF((SUMIF(C102:G102,\"X\",$C$100:$G$100)),(SUMIF(C102:G102,\"X\",$C$100:$G$100)), 1)","v":1}]
[null,"FASCINACIÓN",null,null,null,null,null,1]
[null,"ABURRIMIENTO",null,null,null,null,null,1]
[null,"ENFADO",null,null,null,null,null,1]
[null,"TRISTEZA",null,null,null,null,null,1]
[null,"VERGÜENZA",null,null,null,null,null,1]
[null,"MIEDO",null,null,null,null,null,1]
[null,"REPUGNANCIA",null,null,null,null,null,1]
[null,"DESEO",null,null,null,null,null,1]
[null,"ESPERANZA",null,null,null,null,null,1]
[null,"ORGULLO",null,null,null,null,null,1]

{"sheet":"User03","index":3,"n_rows":112,"n_cols":13,"rows_kept":112,"cut":false,"hidden":false,"merged":[[98,1,99,1],[98,7,99,7],[44,1,45,1],[44,7,45,7],[62,1,63,1],[62,7,63,7],[80,1,81,1],[80,7,81,7],[0,1,0,17],[2,13,5,17],[10,1,11,1],[10,7,11,7],[27,1,28,1],[27,7,28,7]]}
[null,"ESTAS TABLAS UTILIZAN MACROS DE EXCEL, POR LO TANTO CUANDO SE LE CONSULTE AL ABRIR EL ARCHIVO DEBE ACEPTAR Y HABILITAR LAS MACROS PARA QUE FUNCIONEN CORRECTAMENTE"]
[]
[null,"VALORACIÓN EMOCIONAL DE PRODUCTOS, MATERIALES O SERVICIOS",null,null,null,null,null,null,"GÉNERO:",null,"EDAD:",null,"OBS:"]
[]
[null,"DÍGANOS COMO SE SIENTE RESPECTO A CADA PRODUCTO, MATERIAL O SERVICIO"]
[null,"· ESCOJA ENTRE 3 Y 5 EMOCIONES QUE UD. EXPERIMENTE CON MAYOR INTENSIDAD"]
[null,"· MARQUE CON UNA X LAS EMOCIONES Y LOS NIVELES DE INTENSIDAD ESCOGIDOS"]
[null,"· MARQUE SUS PREFERENCIAS CON UN DOBLE CLIC EN LA CELDA ESCOGIDA (PUEDE BORRAR DEL MISMO MODO)"]
[]
[]
[null,"EMOCIONES \\ INTENSIDAD","NADA","POCO","MEDIANAMENTE","BASTANTE","MUCHO","VALORACIÓN"]
[null,null,1.00000000001,2,3,4,5]
[null,{"$f":"User01!B13","v":"ALEGRÍA"},null,null,null,null,null,{"$f":"IF((SUMIF(C13:G13,\"X\",$C$12:$G$12)),(SUMIF(C13:G13,\"X\",$C$12:$G$12)), 1)","v":1}]
[null,{"$f":"User01!B14","v":"SATISFACCIÓN"},null,null,null,null,null,{"$f":"IF((SUMIF(C14:G14,\"X\",$C$12:$G$12)),(SUMIF(C14:G14,\"X\",$C$12:$G$12)), 1)","v":1}]
[null,{"$f":"User01!B15","v":"FASCINACIÓN"},null,null,null,null,null,1]
[null,{"$f":"User01!B16","v":"ABURRIMIENTO"},null,null,null,null,null,1]
[null,{"$f":"User01!B17","v":"ENFADO"},null,null,null,null,null,1]
[null,{"$f":"User01!B18","v":"TRISTEZA"},null,null,null,null,null,1]
[null,{"$f":"User01!B19","v":"VERGÜENZA"},null,null,null,null,null,1]
[null,{"$f":"User01!B20","v":"MIEDO"},null,null,null,null,null,1]
[null,{"$f":"User01!B21","v":"REPUGNANCIA"},null,null,null,null,null,1]
[null,{"$f":"User01!B22","v":"DESEO"},null,null,null,null,null,1]
[null,{"$f":"User01!B23","v":"ESPERANZA"},null,null,null,null,null,1]
[null,{"$f":"User01!B24","v":"ORGULLO"},null,null,null,null,null,1]
[]
[]
[]
[null,"EMOCIONES \\ INTENSIDAD","NADA","POCO","MEDIANAMENTE","BASTANTE","MUCHO","VALORACIÓN"]
[null,null,1.00000000001,2,3,4,5]
[null,{"$f":"$B13","v":"ALEGRÍA"},null,null,null,null,null,{"$f":"IF((SUMIF(C30:G30,\"X\",$C$29:$G$29)),(SUMIF(C30:G30,\"X\",$C$29:$G$29)), 1)","v":1}]
[null,"SATISFACCIÓN",null,null,null,null,null,{"$f":"IF((SUMIF(C31:G31,\"X\",$C$29:$G$29)),(SUMIF(C31:G31,\"X\",$C$29:$G$29)), 1)","v":1}]
[null,"FASCINACIÓN",null,null,null,null,null,1]
[null,"ABURRIMIENTO",null,null,null,null,null,1]
[null,"ENFADO",null,null,null,null,null,1]
[null,"TRISTEZA",null,null,null,null,null,1]
[null,"VERGÜENZA",null,null,null,null,null,1]
[null,"MIEDO",null,null,null,null,null,1]
[null,"REPUGNANCIA",null,null,null,null,null,1]
[null,"DESEO",null,null,null,null,null,1]
[null,"ESPERANZA",null,null,null,null,null,1]
[null,"ORGULLO",null,null,null,null,null,1]
[]
[]
[]
[null,"EMOCIONES \\ INTENSIDAD","NADA","POCO","MEDIANAMENTE","BASTANTE","MUCHO","VALORACIÓN"]
[null,null,1.00000000001,2,3,4,5]
[null,{"$f":"$B30","v":"ALEGRÍA"},null,null,null,null,null,{"$f":"IF((SUMIF(C47:G47,\"X\",$C$46:$G$46)),(SUMIF(C47:G47,\"X\",$C$46:$G$46)), 1)","v":1}]
[null,"SATISFACCIÓN",null,null,null,null,null,{"$f":"IF((SUMIF(C48:G48,\"X\",$C$46:$G$46)),(SUMIF(C48:G48,\"X\",$C$46:$G$46)), 1)","v":1}]
[null,"FASCINACIÓN",null,null,null,null,null,1]
[null,"ABURRIMIENTO",null,null,null,null,null,1]
[null,"ENFADO",null,null,null,null,null,1]
[null,"TRISTEZA",null,null,null,null,null,1]
[null,"VERGÜENZA",null,null,null,null,null,1]
[null,"MIEDO",null,null,null,null,null,1]
[null,"REPUGNANCIA",null,null,null,null,null,1]
[null,"DESEO",null,null,null,null,null,1]
[null,"ESPERANZA",null,null,null,null,null,1]
[null,"ORGULLO",null,null,null,null,null,1]
[]
[]
[]
[]
[null,"EMOCIONES \\ INTENSIDAD","NADA","POCO","MEDIANAMENTE","BASTANTE","MUCHO","VALORACIÓN"]
[null,null,1.00000000001,2,3,4,5]
[null,{"$f":"$B47","v":"ALEGRÍA"},null,null,null,null,null,{"$f":"IF((SUMIF(C65:G65,\"X\",$C$64:$G$64)),(SUMIF(C65:G65,\"X\",$C$64:$G$64)), 1)","v":1}]
[null,"SATISFACCIÓN",null,null,null,null,null,{"$f":"IF((SUMIF(C66:G66,\"X\",$C$64:$G$64)),(SUMIF(C66:G66,\"X\",$C$64:$G$64)), 1)","v":1}]
[null,"FASCINACIÓN",null,null,null,null,null,1]
[null,"ABURRIMIENTO",null,null,null,null,null,1]
[null,"ENFADO",null,null,null,null,null,1]
[null,"TRISTEZA",null,null,null,null,null,1]
[null,"VERGÜENZA",null,null,null,null,null,1]
[null,"MIEDO",null,null,null,null,null,1]
[null,"REPUGNANCIA",null,null,null,null,null,1]
[null,"DESEO",null,null,null,null,null,1]
[null,"ESPERANZA",null,null,null,null,null,1]
[null,"ORGULLO",null,null,null,null,null,1]
[]
[]
[]
[]
[null,"EMOCIONES \\ INTENSIDAD","NADA","POCO","MEDIANAMENTE","BASTANTE","MUCHO","VALORACIÓN"]
[null,null,1.00000000001,2,3,4,5]
[null,{"$f":"$B65","v":"ALEGRÍA"},null,null,null,null,null,{"$f":"IF((SUMIF(C83:G83,\"X\",$C$82:$G$82)),(SUMIF(C83:G83,\"X\",$C$82:$G$82)), 1)","v":1}]
[null,"SATISFACCIÓN",null,null,null,null,null,{"$f":"IF((SUMIF(C84:G84,\"X\",$C$82:$G$82)),(SUMIF(C84:G84,\"X\",$C$82:$G$82)), 1)","v":1}]
[null,"FASCINACIÓN",null,null,null,null,null,1]
[null,"ABURRIMIENTO",null,null,null,null,null,1]
[null,"ENFADO",null,null,null,null,null,1]
[null,"TRISTEZA",null,null,null,null,null,1]
[null,"VERGÜENZA",null,null,null,null,null,1]
[null,"MIEDO",null,null,null,null,null,1]
[null,"REPUGNANCIA",null,null,null,null,null,1]
[null,"DESEO",null,null,null,null,null,1]
[null,"ESPERANZA",null,null,null,null,null,1]
[null,"ORGULLO",null,null,null,null,null,1]
[]
[]
[]
[]
[null,"EMOCIONES \\ INTENSIDAD","NADA","POCO","MEDIANAMENTE","BASTANTE","MUCHO","VALORACIÓN"]
[null,null,1.00000000001,2,3,4,5]
[null,{"$f":"$B83","v":"ALEGRÍA"},null,null,null,null,null,{"$f":"IF((SUMIF(C101:G101,\"X\",$C$100:$G$100)),(SUMIF(C101:G101,\"X\",$C$100:$G$100)), 1)","v":1}]
[null,"SATISFACCIÓN",null,null,null,null,null,{"$f":"IF((SUMIF(C102:G102,\"X\",$C$100:$G$100)),(SUMIF(C102:G102,\"X\",$C$100:$G$100)), 1)","v":1}]
[null,"FASCINACIÓN",null,null,null,null,null,1]
[null,"ABURRIMIENTO",null,null,null,null,null,1]
[null,"ENFADO",null,null,null,null,null,1]
[null,"TRISTEZA",null,null,null,null,null,1]
[null,"VERGÜENZA",null,null,null,null,null,1]
[null,"MIEDO",null,null,null,null,null,1]
[null,"REPUGNANCIA",null,null,null,null,null,1]
[null,"DESEO",null,null,null,null,null,1]
[null,"ESPERANZA",null,null,null,null,null,1]
[null,"ORGULLO",null,null,null,null,null,1]

{"sheet":"User04","index":4,"n_rows":112,"n_cols":13,"rows_kept":112,"cut":false,"hidden":false,"merged":[[98,1,99,1],[98,7,99,7],[44,1,45,1],[44,7,45,7],[62,1,63,1],[62,7,63,7],[80,1,81,1],[80,7,81,7],[0,1,0,17],[2,13,5,17],[10,1,11,1],[10,7,11,7],[27,1,28,1],[27,7,28,7]]}
[null,"ESTAS TABLAS UTILIZAN MACROS DE EXCEL, POR LO TANTO CUANDO SE LE CONSULTE AL ABRIR EL ARCHIVO DEBE ACEPTAR Y HABILITAR LAS MACROS PARA QUE FUNCIONEN CORRECTAMENTE"]
[]
[null,"VALORACIÓN EMOCIONAL DE PRODUCTOS, MATERIALES O SERVICIOS",null,null,null,null,null,null,"GÉNERO:",null,"EDAD:",null,"OBS:"]
[]
[null,"DÍGANOS COMO SE SIENTE RESPECTO A CADA PRODUCTO, MATERIAL O SERVICIO"]
[null,"· ESCOJA ENTRE 3 Y 5 EMOCIONES QUE UD. EXPERIMENTE CON MAYOR INTENSIDAD"]
[null,"· MARQUE CON UNA X LAS EMOCIONES Y LOS NIVELES DE INTENSIDAD ESCOGIDOS"]
[null,"· MARQUE SUS PREFERENCIAS CON UN DOBLE CLIC EN LA CELDA ESCOGIDA (PUEDE BORRAR DEL MISMO MODO)"]
[]
[]
[null,"EMOCIONES \\ INTENSIDAD","NADA","POCO","MEDIANAMENTE","BASTANTE","MUCHO","VALORACIÓN"]
[null,null,1.00000000001,2,3,4,5]
[null,{"$f":"User01!B13","v":"ALEGRÍA"},null,null,null,null,null,{"$f":"IF((SUMIF(C13:G13,\"X\",$C$12:$G$12)),(SUMIF(C13:G13,\"X\",$C$12:$G$12)), 1)","v":1}]
[null,{"$f":"User01!B14","v":"SATISFACCIÓN"},null,null,null,null,null,{"$f":"IF((SUMIF(C14:G14,\"X\",$C$12:$G$12)),(SUMIF(C14:G14,\"X\",$C$12:$G$12)), 1)","v":1}]
[null,{"$f":"User01!B15","v":"FASCINACIÓN"},null,null,null,null,null,1]
[null,{"$f":"User01!B16","v":"ABURRIMIENTO"},null,null,null,null,null,1]
[null,{"$f":"User01!B17","v":"ENFADO"},null,null,null,null,null,1]
[null,{"$f":"User01!B18","v":"TRISTEZA"},null,null,null,null,null,1]
[null,{"$f":"User01!B19","v":"VERGÜENZA"},null,null,null,null,null,1]
[null,{"$f":"User01!B20","v":"MIEDO"},null,null,null,null,null,1]
[null,{"$f":"User01!B21","v":"REPUGNANCIA"},null,null,null,null,null,1]
[null,{"$f":"User01!B22","v":"DESEO"},null,null,null,null,null,1]
[null,{"$f":"User01!B23","v":"ESPERANZA"},null,null,null,null,null,1]
[null,{"$f":"User01!B24","v":"ORGULLO"},null,null,null,null,null,1]
[]
[]
[]
[null,"EMOCIONES \\ INTENSIDAD","NADA","POCO","MEDIANAMENTE","BASTANTE","MUCHO","VALORACIÓN"]
[null,null,1.00000000001,2,3,4,5]
[null,{"$f":"$B13","v":"ALEGRÍA"},null,null,null,null,null,{"$f":"IF((SUMIF(C30:G30,\"X\",$C$29:$G$29)),(SUMIF(C30:G30,\"X\",$C$29:$G$29)), 1)","v":1}]
[null,"SATISFACCIÓN",null,null,null,null,null,{"$f":"IF((SUMIF(C31:G31,\"X\",$C$29:$G$29)),(SUMIF(C31:G31,\"X\",$C$29:$G$29)), 1)","v":1}]
[null,"FASCINACIÓN",null,null,null,null,null,1]
[null,"ABURRIMIENTO",null,null,null,null,null,1]
[null,"ENFADO",null,null,null,null,null,1]
[null,"TRISTEZA",null,null,null,null,null,1]
[null,"VERGÜENZA",null,null,null,null,null,1]
[null,"MIEDO",null,null,null,null,null,1]
[null,"REPUGNANCIA",null,null,null,null,null,1]
[null,"DESEO",null,null,null,null,null,1]
[null,"ESPERANZA",null,null,null,null,null,1]
[null,"ORGULLO",null,null,null,null,null,1]
[]
[]
[]
[null,"EMOCIONES \\ INTENSIDAD","NADA","POCO","MEDIANAMENTE","BASTANTE","MUCHO","VALORACIÓN"]
[null,null,1.00000000001,2,3,4,5]
[null,{"$f":"$B30","v":"ALEGRÍA"},null,null,null,null,null,{"$f":"IF((SUMIF(C47:G47,\"X\",$C$46:$G$46)),(SUMIF(C47:G47,\"X\",$C$46:$G$46)), 1)","v":1}]
[null,"SATISFACCIÓN",null,null,null,null,null,{"$f":"IF((SUMIF(C48:G48,\"X\",$C$46:$G$46)),(SUMIF(C48:G48,\"X\",$C$46:$G$46)), 1)","v":1}]
[null,"FASCINACIÓN",null,null,null,null,null,1]
[null,"ABURRIMIENTO",null,null,null,null,null,1]
[null,"ENFADO",null,null,null,null,null,1]
[null,"TRISTEZA",null,null,null,null,null,1]
[null,"VERGÜENZA",null,null,null,null,null,1]
[null,"MIEDO",null,null,null,null,null,1]
[null,"REPUGNANCIA",null,null,null,null,null,1]
[null,"DESEO",null,null,null,null,null,1]
[null,"ESPERANZA",null,null,null,null,null,1]
[null,"ORGULLO",null,null,null,null,null,1]
[]
[]
[]
[]
[null,"EMOCIONES \\ INTENSIDAD","NADA","POCO","MEDIANAMENTE","BASTANTE","MUCHO","VALORACIÓN"]
[null,null,1.00000000001,2,3,4,5]
[null,{"$f":"$B47","v":"ALEGRÍA"},null,null,null,null,null,{"$f":"IF((SUMIF(C65:G65,\"X\",$C$64:$G$64)),(SUMIF(C65:G65,\"X\",$C$64:$G$64)), 1)","v":1}]
[null,"SATISFACCIÓN",null,null,null,null,null,{"$f":"IF((SUMIF(C66:G66,\"X\",$C$64:$G$64)),(SUMIF(C66:G66,\"X\",$C$64:$G$64)), 1)","v":1}]
[null,"FASCINACIÓN",null,null,null,null,null,1]
[null,"ABURRIMIENTO",null,null,null,null,null,1]
[null,"ENFADO",null,null,null,null,null,1]
[null,"TRISTEZA",null,null,null,null,null,1]
[null,"VERGÜENZA",null,null,null,null,null,1]
[null,"MIEDO",null,null,null,null,null,1]
[null,"REPUGNANCIA",null,null,null,null,null,1]
[null,"DESEO",null,null,null,null,null,1]
[null,"ESPERANZA",null,null,null,null,null,1]
[null,"ORGULLO",null,null,null,null,null,1]
[]
[]
[]
[]
[null,"EMOCIONES \\ INTENSIDAD","NADA","POCO","MEDIANAMENTE","BASTANTE","MUCHO","VALORACIÓN"]
[null,null,1.00000000001,2,3,4,5]
[null,{"$f":"$B65","v":"ALEGRÍA"},null,null,null,null,null,{"$f":"IF((SUMIF(C83:G83,\"X\",$C$82:$G$82)),(SUMIF(C83:G83,\"X\",$C$82:$G$82)), 1)","v":1}]
[null,"SATISFACCIÓN",null,null,null,null,null,{"$f":"IF((SUMIF(C84:G84,\"X\",$C$82:$G$82)),(SUMIF(C84:G84,\"X\",$C$82:$G$82)), 1)","v":1}]
[null,"FASCINACIÓN",null,null,null,null,null,1]
[null,"ABURRIMIENTO",null,null,null,null,null,1]
[null,"ENFADO",null,null,null,null,null,1]
[null,"TRISTEZA",null,null,null,null,null,1]
[null,"VERGÜENZA",null,null,null,null,null,1]
[null,"MIEDO",null,null,null,null,null,1]
[null,"REPUGNANCIA",null,null,null,null,null,1]
[null,"DESEO",null,null,null,null,null,1]
[null,"ESPERANZA",null,null,null,null,null,1]
[null,"ORGULLO",null,null,null,null,null,1]
[]
[]
[]
[]
[null,"EMOCIONES \\ INTENSIDAD","NADA","POCO","MEDIANAMENTE","BASTANTE","MUCHO","VALORACIÓN"]
[null,null,1.00000000001,2,3,4,5]
[null,{"$f":"$B83","v":"ALEGRÍA"},null,null,null,null,null,{"$f":"IF((SUMIF(C101:G101,\"X\",$C$100:$G$100)),(SUMIF(C101:G101,\"X\",$C$100:$G$100)), 1)","v":1}]
[null,"SATISFACCIÓN",null,null,null,null,null,{"$f":"IF((SUMIF(C102:G102,\"X\",$C$100:$G$100)),(SUMIF(C102:G102,\"X\",$C$100:$G$100)), 1)","v":1}]
[null,"FASCINACIÓN",null,null,null,null,null,1]
[null,"ABURRIMIENTO",null,null,null,null,null,1]
[null,"ENFADO",null,null,null,null,null,1]
[null,"TRISTEZA",null,null,null,null,null,1]
[null,"VERGÜENZA",null,null,null,null,null,1]
[null,"MIEDO",null,null,null,null,null,1]
[null,"REPUGNANCIA",null,null,null,null,null,1]
[null,"DESEO",null,null,null,null,null,1]
[null,"ESPERANZA",null,null,null,null,null,1]
[null,"ORGULLO",null,null,null,null,null,1]

{"sheet":"User05","index":5,"n_rows":112,"n_cols":13,"rows_kept":112,"cut":false,"hidden":false,"merged":[[98,1,99,1],[98,7,99,7],[44,1,45,1],[44,7,45,7],[62,1,63,1],[62,7,63,7],[80,1,81,1],[80,7,81,7],[0,1,0,17],[2,13,5,17],[10,1,11,1],[10,7,11,7],[27,1,28,1],[27,7,28,7]]}
[null,"ESTAS TABLAS UTILIZAN MACROS DE EXCEL, POR LO TANTO CUANDO SE LE CONSULTE AL ABRIR EL ARCHIVO DEBE ACEPTAR Y HABILITAR LAS MACROS PARA QUE FUNCIONEN CORRECTAMENTE"]
[]
[null,"VALORACIÓN EMOCIONAL DE PRODUCTOS, MATERIALES O SERVICIOS",null,null,null,null,null,null,"GÉNERO:",null,"EDAD:",null,"OBS:"]
[]
[null,"DÍGANOS COMO SE SIENTE RESPECTO A CADA PRODUCTO, MATERIAL O SERVICIO"]
[null,"· ESCOJA ENTRE 3 Y 5 EMOCIONES QUE UD. EXPERIMENTE CON MAYOR INTENSIDAD"]
[null,"· MARQUE CON UNA X LAS EMOCIONES Y LOS NIVELES DE INTENSIDAD ESCOGIDOS"]
[null,"· MARQUE SUS PREFERENCIAS CON UN DOBLE CLIC EN LA CELDA ESCOGIDA (PUEDE BORRAR DEL MISMO MODO)"]
[]
[]
[null,"EMOCIONES \\ INTENSIDAD","NADA","POCO","MEDIANAMENTE","BASTANTE","MUCHO","VALORACIÓN"]
[null,null,1.00000000001,2,3,4,5]
[null,{"$f":"User01!B13","v":"ALEGRÍA"},null,null,null,null,null,{"$f":"IF((SUMIF(C13:G13,\"X\",$C$12:$G$12)),(SUMIF(C13:G13,\"X\",$C$12:$G$12)), 1)","v":1}]
[null,{"$f":"User01!B14","v":"SATISFACCIÓN"},null,null,null,null,null,{"$f":"IF((SUMIF(C14:G14,\"X\",$C$12:$G$12)),(SUMIF(C14:G14,\"X\",$C$12:$G$12)), 1)","v":1}]
[null,{"$f":"User01!B15","v":"FASCINACIÓN"},null,null,null,null,null,1]
[null,{"$f":"User01!B16","v":"ABURRIMIENTO"},null,null,null,null,null,1]
[null,{"$f":"User01!B17","v":"ENFADO"},null,null,null,null,null,1]
[null,{"$f":"User01!B18","v":"TRISTEZA"},null,null,null,null,null,1]
[null,{"$f":"User01!B19","v":"VERGÜENZA"},null,null,null,null,null,1]
[null,{"$f":"User01!B20","v":"MIEDO"},null,null,null,null,null,1]
[null,{"$f":"User01!B21","v":"REPUGNANCIA"},null,null,null,null,null,1]
[null,{"$f":"User01!B22","v":"DESEO"},null,null,null,null,null,1]
[null,{"$f":"User01!B23","v":"ESPERANZA"},null,null,null,null,null,1]
[null,{"$f":"User01!B24","v":"ORGULLO"},null,null,null,null,null,1]
[]
[]
[]
[null,"EMOCIONES \\ INTENSIDAD","NADA","POCO","MEDIANAMENTE","BASTANTE","MUCHO","VALORACIÓN"]
[null,null,1.00000000001,2,3,4,5]
[null,{"$f":"$B13","v":"ALEGRÍA"},null,null,null,null,null,{"$f":"IF((SUMIF(C30:G30,\"X\",$C$29:$G$29)),(SUMIF(C30:G30,\"X\",$C$29:$G$29)), 1)","v":1}]
[null,"SATISFACCIÓN",null,null,null,null,null,{"$f":"IF((SUMIF(C31:G31,\"X\",$C$29:$G$29)),(SUMIF(C31:G31,\"X\",$C$29:$G$29)), 1)","v":1}]
[null,"FASCINACIÓN",null,null,null,null,null,1]
[null,"ABURRIMIENTO",null,null,null,null,null,1]
[null,"ENFADO",null,null,null,null,null,1]
[null,"TRISTEZA",null,null,null,null,null,1]
[null,"VERGÜENZA",null,null,null,null,null,1]
[null,"MIEDO",null,null,null,null,null,1]
[null,"REPUGNANCIA",null,null,null,null,null,1]
[null,"DESEO",null,null,null,null,null,1]
[null,"ESPERANZA",null,null,null,null,null,1]
[null,"ORGULLO",null,null,null,null,null,1]
[]
[]
[]
[null,"EMOCIONES \\ INTENSIDAD","NADA","POCO","MEDIANAMENTE","BASTANTE","MUCHO","VALORACIÓN"]
[null,null,1.00000000001,2,3,4,5]
[null,{"$f":"$B30","v":"ALEGRÍA"},null,null,null,null,null,{"$f":"IF((SUMIF(C47:G47,\"X\",$C$46:$G$46)),(SUMIF(C47:G47,\"X\",$C$46:$G$46)), 1)","v":1}]
[null,"SATISFACCIÓN",null,null,null,null,null,{"$f":"IF((SUMIF(C48:G48,\"X\",$C$46:$G$46)),(SUMIF(C48:G48,\"X\",$C$46:$G$46)), 1)","v":1}]
[null,"FASCINACIÓN",null,null,null,null,null,1]
[null,"ABURRIMIENTO",null,null,null,null,null,1]
[null,"ENFADO",null,null,null,null,null,1]
[null,"TRISTEZA",null,null,null,null,null,1]
[null,"VERGÜENZA",null,null,null,null,null,1]
[null,"MIEDO",null,null,null,null,null,1]
[null,"REPUGNANCIA",null,null,null,null,null,1]
[null,"DESEO",null,null,null,null,null,1]
[null,"ESPERANZA",null,null,null,null,null,1]
[null,"ORGULLO",null,null,null,null,null,1]
[]
[]
[]
[]
[null,"EMOCIONES \\ INTENSIDAD","NADA","POCO","MEDIANAMENTE","BASTANTE","MUCHO","VALORACIÓN"]
[null,null,1.00000000001,2,3,4,5]
[null,{"$f":"$B47","v":"ALEGRÍA"},null,null,null,null,null,{"$f":"IF((SUMIF(C65:G65,\"X\",$C$64:$G$64)),(SUMIF(C65:G65,\"X\",$C$64:$G$64)), 1)","v":1}]
[null,"SATISFACCIÓN",null,null,null,null,null,{"$f":"IF((SUMIF(C66:G66,\"X\",$C$64:$G$64)),(SUMIF(C66:G66,\"X\",$C$64:$G$64)), 1)","v":1}]
[null,"FASCINACIÓN",null,null,null,null,null,1]
[null,"ABURRIMIENTO",null,null,null,null,null,1]
[null,"ENFADO",null,null,null,null,null,1]
[null,"TRISTEZA",null,null,null,null,null,1]
[null,"VERGÜENZA",null,null,null,null,null,1]
[null,"MIEDO",null,null,null,null,null,1]
[null,"REPUGNANCIA",null,null,null,null,null,1]
[null,"DESEO",null,null,null,null,null,1]
[null,"ESPERANZA",null,null,null,null,null,1]
[null,"ORGULLO",null,null,null,null,null,1]
[]
[]
[]
[]
[null,"EMOCIONES \\ INTENSIDAD","NADA","POCO","MEDIANAMENTE","BASTANTE","MUCHO","VALORACIÓN"]
[null,null,1.00000000001,2,3,4,5]
[null,{"$f":"$B65","v":"ALEGRÍA"},null,null,null,null,null,{"$f":"IF((SUMIF(C83:G83,\"X\",$C$82:$G$82)),(SUMIF(C83:G83,\"X\",$C$82:$G$82)), 1)","v":1}]
[null,"SATISFACCIÓN",null,null,null,null,null,{"$f":"IF((SUMIF(C84:G84,\"X\",$C$82:$G$82)),(SUMIF(C84:G84,\"X\",$C$82:$G$82)), 1)","v":1}]
[null,"FASCINACIÓN",null,null,null,null,null,1]
[null,"ABURRIMIENTO",null,null,null,null,null,1]
[null,"ENFADO",null,null,null,null,null,1]
[null,"TRISTEZA",null,null,null,null,null,1]
[null,"VERGÜENZA",null,null,null,null,null,1]
[null,"MIEDO",null,null,null,null,null,1]
[null,"REPUGNANCIA",null,null,null,null,null,1]
[null,"DESEO",null,null,null,null,null,1]
[null,"ESPERANZA",null,null,null,null,null,1]
[null,"ORGULLO",null,null,null,null,null,1]
[]
[]
[]
[]
[null,"EMOCIONES \\ INTENSIDAD","NADA","POCO","MEDIANAMENTE","BASTANTE","MUCHO","VALORACIÓN"]
[null,null,1.00000000001,2,3,4,5]
[null,{"$f":"$B83","v":"ALEGRÍA"},null,null,null,null,null,{"$f":"IF((SUMIF(C101:G101,\"X\",$C$100:$G$100)),(SUMIF(C101:G101,\"X\",$C$100:$G$100)), 1)","v":1}]
[null,"SATISFACCIÓN",null,null,null,null,null,{"$f":"IF((SUMIF(C102:G102,\"X\",$C$100:$G$100)),(SUMIF(C102:G102,\"X\",$C$100:$G$100)), 1)","v":1}]
[null,"FASCINACIÓN",null,null,null,null,null,1]
[null,"ABURRIMIENTO",null,null,null,null,null,1]
[null,"ENFADO",null,null,null,null,null,1]
[null,"TRISTEZA",null,null,null,null,null,1]
[null,"VERGÜENZA",null,null,null,null,null,1]
[null,"MIEDO",null,null,null,null,null,1]
[null,"REPUGNANCIA",null,null,null,null,null,1]
[null,"DESEO",null,null,null,null,null,1]
[null,"ESPERANZA",null,null,null,null,null,1]
[null,"ORGULLO",null,null,null,null,null,1]

{"sheet":"User06","index":6,"n_rows":112,"n_cols":13,"rows_kept":112,"cut":false,"hidden":false,"merged":[[98,1,99,1],[98,7,99,7],[44,1,45,1],[44,7,45,7],[62,1,63,1],[62,7,63,7],[80,1,81,1],[80,7,81,7],[0,1,0,17],[2,13,5,17],[10,1,11,1],[10,7,11,7],[27,1,28,1],[27,7,28,7]]}
[null,"ESTAS TABLAS UTILIZAN MACROS DE EXCEL, POR LO TANTO CUANDO SE LE CONSULTE AL ABRIR EL ARCHIVO DEBE ACEPTAR Y HABILITAR LAS MACROS PARA QUE FUNCIONEN CORRECTAMENTE"]
[]
[null,"VALORACIÓN EMOCIONAL DE PRODUCTOS, MATERIALES O SERVICIOS",null,null,null,null,null,null,"GÉNERO:",null,"EDAD:",null,"OBS:"]
[]
[null,"DÍGANOS COMO SE SIENTE RESPECTO A CADA PRODUCTO, MATERIAL O SERVICIO"]
[null,"· ESCOJA ENTRE 3 Y 5 EMOCIONES QUE UD. EXPERIMENTE CON MAYOR INTENSIDAD"]
[null,"· MARQUE CON UNA X LAS EMOCIONES Y LOS NIVELES DE INTENSIDAD ESCOGIDOS"]
[null,"· MARQUE SUS PREFERENCIAS CON UN DOBLE CLIC EN LA CELDA ESCOGIDA (PUEDE BORRAR DEL MISMO MODO)"]
[]
[]
[null,"EMOCIONES \\ INTENSIDAD","NADA","POCO","MEDIANAMENTE","BASTANTE","MUCHO","VALORACIÓN"]
[null,null,1.00000000001,2,3,4,5]
[null,{"$f":"User01!B13","v":"ALEGRÍA"},null,null,null,null,null,{"$f":"IF((SUMIF(C13:G13,\"X\",$C$12:$G$12)),(SUMIF(C13:G13,\"X\",$C$12:$G$12)), 1)","v":1}]
[null,{"$f":"User01!B14","v":"SATISFACCIÓN"},null,null,null,null,null,{"$f":"IF((SUMIF(C14:G14,\"X\",$C$12:$G$12)),(SUMIF(C14:G14,\"X\",$C$12:$G$12)), 1)","v":1}]
[null,{"$f":"User01!B15","v":"FASCINACIÓN"},null,null,null,null,null,1]
[null,{"$f":"User01!B16","v":"ABURRIMIENTO"},null,null,null,null,null,1]
[null,{"$f":"User01!B17","v":"ENFADO"},null,null,null,null,null,1]
[null,{"$f":"User01!B18","v":"TRISTEZA"},null,null,null,null,null,1]
[null,{"$f":"User01!B19","v":"VERGÜENZA"},null,null,null,null,null,1]
[null,{"$f":"User01!B20","v":"MIEDO"},null,null,null,null,null,1]
[null,{"$f":"User01!B21","v":"REPUGNANCIA"},null,null,null,null,null,1]
[null,{"$f":"User01!B22","v":"DESEO"},null,null,null,null,null,1]
[null,{"$f":"User01!B23","v":"ESPERANZA"},null,null,null,null,null,1]
[null,{"$f":"User01!B24","v":"ORGULLO"},null,null,null,null,null,1]
[]
[]
[]
[null,"EMOCIONES \\ INTENSIDAD","NADA","POCO","MEDIANAMENTE","BASTANTE","MUCHO","VALORACIÓN"]
[null,null,1.00000000001,2,3,4,5]
[null,{"$f":"$B13","v":"ALEGRÍA"},null,null,null,null,null,{"$f":"IF((SUMIF(C30:G30,\"X\",$C$29:$G$29)),(SUMIF(C30:G30,\"X\",$C$29:$G$29)), 1)","v":1}]
[null,"SATISFACCIÓN",null,null,null,null,null,{"$f":"IF((SUMIF(C31:G31,\"X\",$C$29:$G$29)),(SUMIF(C31:G31,\"X\",$C$29:$G$29)), 1)","v":1}]
[null,"FASCINACIÓN",null,null,null,null,null,1]
[null,"ABURRIMIENTO",null,null,null,null,null,1]
[null,"ENFADO",null,null,null,null,null,1]
[null,"TRISTEZA",null,null,null,null,null,1]
[null,"VERGÜENZA",null,null,null,null,null,1]
[null,"MIEDO",null,null,null,null,null,1]
[null,"REPUGNANCIA",null,null,null,null,null,1]
[null,"DESEO",null,null,null,null,null,1]
[null,"ESPERANZA",null,null,null,null,null,1]
[null,"ORGULLO",null,null,null,null,null,1]
[]
[]
[]
[null,"EMOCIONES \\ INTENSIDAD","NADA","POCO","MEDIANAMENTE","BASTANTE","MUCHO","VALORACIÓN"]
[null,null,1.00000000001,2,3,4,5]
[null,{"$f":"$B30","v":"ALEGRÍA"},null,null,null,null,null,{"$f":"IF((SUMIF(C47:G47,\"X\",$C$46:$G$46)),(SUMIF(C47:G47,\"X\",$C$46:$G$46)), 1)","v":1}]
[null,"SATISFACCIÓN",null,null,null,null,null,{"$f":"IF((SUMIF(C48:G48,\"X\",$C$46:$G$46)),(SUMIF(C48:G48,\"X\",$C$46:$G$46)), 1)","v":1}]
[null,"FASCINACIÓN",null,null,null,null,null,1]
[null,"ABURRIMIENTO",null,null,null,null,null,1]
[null,"ENFADO",null,null,null,null,null,1]
[null,"TRISTEZA",null,null,null,null,null,1]
[null,"VERGÜENZA",null,null,null,null,null,1]
[null,"MIEDO",null,null,null,null,null,1]
[null,"REPUGNANCIA",null,null,null,null,null,1]
[null,"DESEO",null,null,null,null,null,1]
[null,"ESPERANZA",null,null,null,null,null,1]
[null,"ORGULLO",null,null,null,null,null,1]
[]
[]
[]
[]
[null,"EMOCIONES \\ INTENSIDAD","NADA","POCO","MEDIANAMENTE","BASTANTE","MUCHO","VALORACIÓN"]
[null,null,1.00000000001,2,3,4,5]
[null,{"$f":"$B47","v":"ALEGRÍA"},null,null,null,null,null,{"$f":"IF((SUMIF(C65:G65,\"X\",$C$64:$G$64)),(SUMIF(C65:G65,\"X\",$C$64:$G$64)), 1)","v":1}]
[null,"SATISFACCIÓN",null,null,null,null,null,{"$f":"IF((SUMIF(C66:G66,\"X\",$C$64:$G$64)),(SUMIF(C66:G66,\"X\",$C$64:$G$64)), 1)","v":1}]
[null,"FASCINACIÓN",null,null,null,null,null,1]
[null,"ABURRIMIENTO",null,null,null,null,null,1]
[null,"ENFADO",null,null,null,null,null,1]
[null,"TRISTEZA",null,null,null,null,null,1]
[null,"VERGÜENZA",null,null,null,null,null,1]
[null,"MIEDO",null,null,null,null,null,1]
[null,"REPUGNANCIA",null,null,null,null,null,1]
[null,"DESEO",null,null,null,null,null,1]
[null,"ESPERANZA",null,null,null,null,null,1]
[null,"ORGULLO",null,null,null,null,null,1]
[]
[]
[]
[]
[null,"EMOCIONES \\ INTENSIDAD","NADA","POCO","MEDIANAMENTE","BASTANTE","MUCHO","VALORACIÓN"]
[null,null,1.00000000001,2,3,4,5]
[null,{"$f":"$B65","v":"ALEGRÍA"},null,null,null,null,null,{"$f":"IF((SUMIF(C83:G83,\"X\",$C$82:$G$82)),(SUMIF(C83:G83,\"X\",$C$82:$G$82)), 1)","v":1}]
[null,"SATISFACCIÓN",null,null,null,null,null,{"$f":"IF((SUMIF(C84:G84,\"X\",$C$82:$G$82)),(SUMIF(C84:G84,\"X\",$C$82:$G$82)), 1)","v":1}]
[null,"FASCINACIÓN",null,null,null,null,null,1]
[null,"ABURRIMIENTO",null,null,null,null,null,1]
[null,"ENFADO",null,null,null,null,null,1]
[null,"TRISTEZA",null,null,null,null,null,1]
[null,"VERGÜENZA",null,null,null,null,null,1]
[null,"MIEDO",null,null,null,null,null,1]
[null,"REPUGNANCIA",null,null,null,null,null,1]
[null,"DESEO",null,null,null,null,null,1]
[null,"ESPERANZA",null,null,null,null,null,1]
[null,"ORGULLO",null,null,null,null,null,1]
[]
[]
[]
[]
[null,"EMOCIONES \\ INTENSIDAD","NADA","POCO","MEDIANAMENTE","BASTANTE","MUCHO","VALORACIÓN"]
[null,null,1.00000000001,2,3,4,5]
[null,{"$f":"$B83","v":"ALEGRÍA"},null,null,null,null,null,{"$f":"IF((SUMIF(C101:G101,\"X\",$C$100:$G$100)),(SUMIF(C101:G101,\"X\",$C$100:$G$100)), 1)","v":1}]
[null,"SATISFACCIÓN",null,null,null,null,null,{"$f":"IF((SUMIF(C102:G102,\"X\",$C$100:$G$100)),(SUMIF(C102:G102,\"X\",$C$100:$G$100)), 1)","v":1}]
[null,"FASCINACIÓN",null,null,null,null,null,1]
[null,"ABURRIMIENTO",null,null,null,null,null,1]
[null,"ENFADO",null,null,null,null,null,1]
[null,"TRISTEZA",null,null,null,null,null,1]
[null,"VERGÜENZA",null,null,null,null,null,1]
[null,"MIEDO",null,null,null,null,null,1]
[null,"REPUGNANCIA",null,null,null,null,null,1]
[null,"DESEO",null,null,null,null,null,1]
[null,"ESPERANZA",null,null,null,null,null,1]
[null,"ORGULLO",null,null,null,null,null,1]

{"sheet":"User07","index":7,"n_rows":112,"n_cols":13,"rows_kept":112,"cut":false,"hidden":false,"merged":[[98,1,99,1],[98,7,99,7],[44,1,45,1],[44,7,45,7],[62,1,63,1],[62,7,63,7],[80,1,81,1],[80,7,81,7],[0,1,0,17],[2,13,5,17],[10,1,11,1],[10,7,11,7],[27,1,28,1],[27,7,28,7]]}
[null,"ESTAS TABLAS UTILIZAN MACROS DE EXCEL, POR LO TANTO CUANDO SE LE CONSULTE AL ABRIR EL ARCHIVO DEBE ACEPTAR Y HABILITAR LAS MACROS PARA QUE FUNCIONEN CORRECTAMENTE"]
[]
[null,"VALORACIÓN EMOCIONAL DE PRODUCTOS, MATERIALES O SERVICIOS",null,null,null,null,null,null,"GÉNERO:",null,"EDAD:",null,"OBS:"]
[]
[null,"DÍGANOS COMO SE SIENTE RESPECTO A CADA PRODUCTO, MATERIAL O SERVICIO"]
[null,"· ESCOJA ENTRE 3 Y 5 EMOCIONES QUE UD. EXPERIMENTE CON MAYOR INTENSIDAD"]
[null,"· MARQUE CON UNA X LAS EMOCIONES Y LOS NIVELES DE INTENSIDAD ESCOGIDOS"]
[null,"· MARQUE SUS PREFERENCIAS CON UN DOBLE CLIC EN LA CELDA ESCOGIDA (PUEDE BORRAR DEL MISMO MODO)"]
[]
[]
[null,"EMOCIONES \\ INTENSIDAD","NADA","POCO","MEDIANAMENTE","BASTANTE","MUCHO","VALORACIÓN"]
[null,null,1.00000000001,2,3,4,5]
[null,{"$f":"User01!B13","v":"ALEGRÍA"},null,null,null,null,null,{"$f":"IF((SUMIF(C13:G13,\"X\",$C$12:$G$12)),(SUMIF(C13:G13,\"X\",$C$12:$G$12)), 1)","v":1}]
[null,{"$f":"User01!B14","v":"SATISFACCIÓN"},null,null,null,null,null,{"$f":"IF((SUMIF(C14:G14,\"X\",$C$12:$G$12)),(SUMIF(C14:G14,\"X\",$C$12:$G$12)), 1)","v":1}]
[null,{"$f":"User01!B15","v":"FASCINACIÓN"},null,null,null,null,null,1]
[null,{"$f":"User01!B16","v":"ABURRIMIENTO"},null,null,null,null,null,1]
[null,{"$f":"User01!B17","v":"ENFADO"},null,null,null,null,null,1]
[null,{"$f":"User01!B18","v":"TRISTEZA"},null,null,null,null,null,1]
[null,{"$f":"User01!B19","v":"VERGÜENZA"},null,null,null,null,null,1]
[null,{"$f":"User01!B20","v":"MIEDO"},null,null,null,null,null,1]
[null,{"$f":"User01!B21","v":"REPUGNANCIA"},null,null,null,null,null,1]
[null,{"$f":"User01!B22","v":"DESEO"},null,null,null,null,null,1]
[null,{"$f":"User01!B23","v":"ESPERANZA"},null,null,null,null,null,1]
[null,{"$f":"User01!B24","v":"ORGULLO"},null,null,null,null,null,1]
[]
[]
[]
[null,"EMOCIONES \\ INTENSIDAD","NADA","POCO","MEDIANAMENTE","BASTANTE","MUCHO","VALORACIÓN"]
[null,null,1.00000000001,2,3,4,5]
[null,{"$f":"$B13","v":"ALEGRÍA"},null,null,null,null,null,{"$f":"IF((SUMIF(C30:G30,\"X\",$C$29:$G$29)),(SUMIF(C30:G30,\"X\",$C$29:$G$29)), 1)","v":1}]
[null,"SATISFACCIÓN",null,null,null,null,null,{"$f":"IF((SUMIF(C31:G31,\"X\",$C$29:$G$29)),(SUMIF(C31:G31,\"X\",$C$29:$G$29)), 1)","v":1}]
[null,"FASCINACIÓN",null,null,null,null,null,1]
[null,"ABURRIMIENTO",null,null,null,null,null,1]
[null,"ENFADO",null,null,null,null,null,1]
[null,"TRISTEZA",null,null,null,null,null,1]
[null,"VERGÜENZA",null,null,null,null,null,1]
[null,"MIEDO",null,null,null,null,null,1]
[null,"REPUGNANCIA",null,null,null,null,null,1]
[null,"DESEO",null,null,null,null,null,1]
[null,"ESPERANZA",null,null,null,null,null,1]
[null,"ORGULLO",null,null,null,null,null,1]
[]
[]
[]
[null,"EMOCIONES \\ INTENSIDAD","NADA","POCO","MEDIANAMENTE","BASTANTE","MUCHO","VALORACIÓN"]
[null,null,1.00000000001,2,3,4,5]
[null,{"$f":"$B30","v":"ALEGRÍA"},null,null,null,null,null,{"$f":"IF((SUMIF(C47:G47,\"X\",$C$46:$G$46)),(SUMIF(C47:G47,\"X\",$C$46:$G$46)), 1)","v":1}]
[null,"SATISFACCIÓN",null,null,null,null,null,{"$f":"IF((SUMIF(C48:G48,\"X\",$C$46:$G$46)),(SUMIF(C48:G48,\"X\",$C$46:$G$46)), 1)","v":1}]
[null,"FASCINACIÓN",null,null,null,null,null,1]
[null,"ABURRIMIENTO",null,null,null,null,null,1]
[null,"ENFADO",null,null,null,null,null,1]
[null,"TRISTEZA",null,null,null,null,null,1]
[null,"VERGÜENZA",null,null,null,null,null,1]
[null,"MIEDO",null,null,null,null,null,1]
[null,"REPUGNANCIA",null,null,null,null,null,1]
[null,"DESEO",null,null,null,null,null,1]
[null,"ESPERANZA",null,null,null,null,null,1]
[null,"ORGULLO",null,null,null,null,null,1]
[]
[]
[]
[]
[null,"EMOCIONES \\ INTENSIDAD","NADA","POCO","MEDIANAMENTE","BASTANTE","MUCHO","VALORACIÓN"]
[null,null,1.00000000001,2,3,4,5]
[null,{"$f":"$B47","v":"ALEGRÍA"},null,null,null,null,null,{"$f":"IF((SUMIF(C65:G65,\"X\",$C$64:$G$64)),(SUMIF(C65:G65,\"X\",$C$64:$G$64)), 1)","v":1}]
[null,"SATISFACCIÓN",null,null,null,null,null,{"$f":"IF((SUMIF(C66:G66,\"X\",$C$64:$G$64)),(SUMIF(C66:G66,\"X\",$C$64:$G$64)), 1)","v":1}]
[null,"FASCINACIÓN",null,null,null,null,null,1]
[null,"ABURRIMIENTO",null,null,null,null,null,1]
[null,"ENFADO",null,null,null,null,null,1]
[null,"TRISTEZA",null,null,null,null,null,1]
[null,"VERGÜENZA",null,null,null,null,null,1]
[null,"MIEDO",null,null,null,null,null,1]
[null,"REPUGNANCIA",null,null,null,null,null,1]
[null,"DESEO",null,null,null,null,null,1]
[null,"ESPERANZA",null,null,null,null,null,1]
[null,"ORGULLO",null,null,null,null,null,1]
[]
[]
[]
[]
[null,"EMOCIONES \\ INTENSIDAD","NADA","POCO","MEDIANAMENTE","BASTANTE","MUCHO","VALORACIÓN"]
[null,null,1.00000000001,2,3,4,5]
[null,{"$f":"$B65","v":"ALEGRÍA"},null,null,null,null,null,{"$f":"IF((SUMIF(C83:G83,\"X\",$C$82:$G$82)),(SUMIF(C83:G83,\"X\",$C$82:$G$82)), 1)","v":1}]
[null,"SATISFACCIÓN",null,null,null,null,null,{"$f":"IF((SUMIF(C84:G84,\"X\",$C$82:$G$82)),(SUMIF(C84:G84,\"X\",$C$82:$G$82)), 1)","v":1}]
[null,"FASCINACIÓN",null,null,null,null,null,1]
[null,"ABURRIMIENTO",null,null,null,null,null,1]
[null,"ENFADO",null,null,null,null,null,1]
[null,"TRISTEZA",null,null,null,null,null,1]
[null,"VERGÜENZA",null,null,null,null,null,1]
[null,"MIEDO",null,null,null,null,null,1]
[null,"REPUGNANCIA",null,null,null,null,null,1]
[null,"DESEO",null,null,null,null,null,1]
[null,"ESPERANZA",null,null,null,null,null,1]
[null,"ORGULLO",null,null,null,null,null,1]
[]
[]
[]
[]
[null,"EMOCIONES \\ INTENSIDAD","NADA","POCO","MEDIANAMENTE","BASTANTE","MUCHO","VALORACIÓN"]
[null,null,1.00000000001,2,3,4,5]
[null,{"$f":"$B83","v":"ALEGRÍA"},null,null,null,null,null,{"$f":"IF((SUMIF(C101:G101,\"X\",$C$100:$G$100)),(SUMIF(C101:G101,\"X\",$C$100:$G$100)), 1)","v":1}]
[null,"SATISFACCIÓN",null,null,null,null,null,{"$f":"IF((SUMIF(C102:G102,\"X\",$C$100:$G$100)),(SUMIF(C102:G102,\"X\",$C$100:$G$100)), 1)","v":1}]
[null,"FASCINACIÓN",null,null,null,null,null,1]
[null,"ABURRIMIENTO",null,null,null,null,null,1]
[null,"ENFADO",null,null,null,null,null,1]
[null,"TRISTEZA",null,null,null,null,null,1]
[null,"VERGÜENZA",null,null,null,null,null,1]
[null,"MIEDO",null,null,null,null,null,1]
[null,"REPUGNANCIA",null,null,null,null,null,1]
[null,"DESEO",null,null,null,null,null,1]
[null,"ESPERANZA",null,null,null,null,null,1]
[null,"ORGULLO",null,null,null,null,null,1]

{"sheet":"User08","index":8,"n_rows":112,"n_cols":13,"rows_kept":112,"cut":false,"hidden":false,"merged":[[98,1,99,1],[98,7,99,7],[44,1,45,1],[44,7,45,7],[62,1,63,1],[62,7,63,7],[80,1,81,1],[80,7,81,7],[0,1,0,17],[2,13,5,17],[10,1,11,1],[10,7,11,7],[27,1,28,1],[27,7,28,7]]}
[null,"ESTAS TABLAS UTILIZAN MACROS DE EXCEL, POR LO TANTO CUANDO SE LE CONSULTE AL ABRIR EL ARCHIVO DEBE ACEPTAR Y HABILITAR LAS MACROS PARA QUE FUNCIONEN CORRECTAMENTE"]
[]
[null,"VALORACIÓN EMOCIONAL DE PRODUCTOS, MATERIALES O SERVICIOS",null,null,null,null,null,null,"GÉNERO:",null,"EDAD:",null,"OBS:"]
[]
[null,"DÍGANOS COMO SE SIENTE RESPECTO A CADA PRODUCTO, MATERIAL O SERVICIO"]
[null,"· ESCOJA ENTRE 3 Y 5 EMOCIONES QUE UD. EXPERIMENTE CON MAYOR INTENSIDAD"]
[null,"· MARQUE CON UNA X LAS EMOCIONES Y LOS NIVELES DE INTENSIDAD ESCOGIDOS"]
[null,"· MARQUE SUS PREFERENCIAS CON UN DOBLE CLIC EN LA CELDA ESCOGIDA (PUEDE BORRAR DEL MISMO MODO)"]
[]
[]
[null,"EMOCIONES \\ INTENSIDAD","NADA","POCO","MEDIANAMENTE","BASTANTE","MUCHO","VALORACIÓN"]
[null,null,1.00000000001,2,3,4,5]
[null,{"$f":"User01!B13","v":"ALEGRÍA"},null,null,null,null,null,{"$f":"IF((SUMIF(C13:G13,\"X\",$C$12:$G$12)),(SUMIF(C13:G13,\"X\",$C$12:$G$12)), 1)","v":1}]
[null,{"$f":"User01!B14","v":"SATISFACCIÓN"},null,null,null,null,null,{"$f":"IF((SUMIF(C14:G14,\"X\",$C$12:$G$12)),(SUMIF(C14:G14,\"X\",$C$12:$G$12)), 1)","v":1}]
[null,{"$f":"User01!B15","v":"FASCINACIÓN"},null,null,null,null,null,1]
[null,{"$f":"User01!B16","v":"ABURRIMIENTO"},null,null,null,null,null,1]
[null,{"$f":"User01!B17","v":"ENFADO"},null,null,null,null,null,1]
[null,{"$f":"User01!B18","v":"TRISTEZA"},null,null,null,null,null,1]
[null,{"$f":"User01!B19","v":"VERGÜENZA"},null,null,null,null,null,1]
[null,{"$f":"User01!B20","v":"MIEDO"},null,null,null,null,null,1]
[null,{"$f":"User01!B21","v":"REPUGNANCIA"},null,null,null,null,null,1]
[null,{"$f":"User01!B22","v":"DESEO"},null,null,null,null,null,1]
[null,{"$f":"User01!B23","v":"ESPERANZA"},null,null,null,null,null,1]
[null,{"$f":"User01!B24","v":"ORGULLO"},null,null,null,null,null,1]
[]
[]
[]
[null,"EMOCIONES \\ INTENSIDAD","NADA","POCO","MEDIANAMENTE","BASTANTE","MUCHO","VALORACIÓN"]
[null,null,1.00000000001,2,3,4,5]
[null,{"$f":"$B13","v":"ALEGRÍA"},null,null,null,null,null,{"$f":"IF((SUMIF(C30:G30,\"X\",$C$29:$G$29)),(SUMIF(C30:G30,\"X\",$C$29:$G$29)), 1)","v":1}]
[null,"SATISFACCIÓN",null,null,null,null,null,{"$f":"IF((SUMIF(C31:G31,\"X\",$C$29:$G$29)),(SUMIF(C31:G31,\"X\",$C$29:$G$29)), 1)","v":1}]
[null,"FASCINACIÓN",null,null,null,null,null,1]
[null,"ABURRIMIENTO",null,null,null,null,null,1]
[null,"ENFADO",null,null,null,null,null,1]
[null,"TRISTEZA",null,null,null,null,null,1]
[null,"VERGÜENZA",null,null,null,null,null,1]
[null,"MIEDO",null,null,null,null,null,1]
[null,"REPUGNANCIA",null,null,null,null,null,1]
[null,"DESEO",null,null,null,null,null,1]
[null,"ESPERANZA",null,null,null,null,null,1]
[null,"ORGULLO",null,null,null,null,null,1]
[]
[]
[]
[null,"EMOCIONES \\ INTENSIDAD","NADA","POCO","MEDIANAMENTE","BASTANTE","MUCHO","VALORACIÓN"]
[null,null,1.00000000001,2,3,4,5]
[null,{"$f":"$B30","v":"ALEGRÍA"},null,null,null,null,null,{"$f":"IF((SUMIF(C47:G47,\"X\",$C$46:$G$46)),(SUMIF(C47:G47,\"X\",$C$46:$G$46)), 1)","v":1}]
[null,"SATISFACCIÓN",null,null,null,null,null,{"$f":"IF((SUMIF(C48:G48,\"X\",$C$46:$G$46)),(SUMIF(C48:G48,\"X\",$C$46:$G$46)), 1)","v":1}]
[null,"FASCINACIÓN",null,null,null,null,null,1]
[null,"ABURRIMIENTO",null,null,null,null,null,1]
[null,"ENFADO",null,null,null,null,null,1]
[null,"TRISTEZA",null,null,null,null,null,1]
[null,"VERGÜENZA",null,null,null,null,null,1]
[null,"MIEDO",null,null,null,null,null,1]
[null,"REPUGNANCIA",null,null,null,null,null,1]
[null,"DESEO",null,null,null,null,null,1]
[null,"ESPERANZA",null,null,null,null,null,1]
[null,"ORGULLO",null,null,null,null,null,1]
[]
[]
[]
[]
[null,"EMOCIONES \\ INTENSIDAD","NADA","POCO","MEDIANAMENTE","BASTANTE","MUCHO","VALORACIÓN"]
[null,null,1.00000000001,2,3,4,5]
[null,{"$f":"$B47","v":"ALEGRÍA"},null,null,null,null,null,{"$f":"IF((SUMIF(C65:G65,\"X\",$C$64:$G$64)),(SUMIF(C65:G65,\"X\",$C$64:$G$64)), 1)","v":1}]
[null,"SATISFACCIÓN",null,null,null,null,null,{"$f":"IF((SUMIF(C66:G66,\"X\",$C$64:$G$64)),(SUMIF(C66:G66,\"X\",$C$64:$G$64)), 1)","v":1}]
[null,"FASCINACIÓN",null,null,null,null,null,1]
[null,"ABURRIMIENTO",null,null,null,null,null,1]
[null,"ENFADO",null,null,null,null,null,1]
[null,"TRISTEZA",null,null,null,null,null,1]
[null,"VERGÜENZA",null,null,null,null,null,1]
[null,"MIEDO",null,null,null,null,null,1]
[null,"REPUGNANCIA",null,null,null,null,null,1]
[null,"DESEO",null,null,null,null,null,1]
[null,"ESPERANZA",null,null,null,null,null,1]
[null,"ORGULLO",null,null,null,null,null,1]
[]
[]
[]
[]
[null,"EMOCIONES \\ INTENSIDAD","NADA","POCO","MEDIANAMENTE","BASTANTE","MUCHO","VALORACIÓN"]
[null,null,1.00000000001,2,3,4,5]
[null,{"$f":"$B65","v":"ALEGRÍA"},null,null,null,null,null,{"$f":"IF((SUMIF(C83:G83,\"X\",$C$82:$G$82)),(SUMIF(C83:G83,\"X\",$C$82:$G$82)), 1)","v":1}]
[null,"SATISFACCIÓN",null,null,null,null,null,{"$f":"IF((SUMIF(C84:G84,\"X\",$C$82:$G$82)),(SUMIF(C84:G84,\"X\",$C$82:$G$82)), 1)","v":1}]
[null,"FASCINACIÓN",null,null,null,null,null,1]
[null,"ABURRIMIENTO",null,null,null,null,null,1]
[null,"ENFADO",null,null,null,null,null,1]
[null,"TRISTEZA",null,null,null,null,null,1]
[null,"VERGÜENZA",null,null,null,null,null,1]
[null,"MIEDO",null,null,null,null,null,1]
[null,"REPUGNANCIA",null,null,null,null,null,1]
[null,"DESEO",null,null,null,null,null,1]
[null,"ESPERANZA",null,null,null,null,null,1]
[null,"ORGULLO",null,null,null,null,null,1]
[]
[]
[]
[]
[null,"EMOCIONES \\ INTENSIDAD","NADA","POCO","MEDIANAMENTE","BASTANTE","MUCHO","VALORACIÓN"]
[null,null,1.00000000001,2,3,4,5]
[null,{"$f":"$B83","v":"ALEGRÍA"},null,null,null,null,null,{"$f":"IF((SUMIF(C101:G101,\"X\",$C$100:$G$100)),(SUMIF(C101:G101,\"X\",$C$100:$G$100)), 1)","v":1}]
[null,"SATISFACCIÓN",null,null,null,null,null,{"$f":"IF((SUMIF(C102:G102,\"X\",$C$100:$G$100)),(SUMIF(C102:G102,\"X\",$C$100:$G$100)), 1)","v":1}]
[null,"FASCINACIÓN",null,null,null,null,null,1]
[null,"ABURRIMIENTO",null,null,null,null,null,1]
[null,"ENFADO",null,null,null,null,null,1]
[null,"TRISTEZA",null,null,null,null,null,1]
[null,"VERGÜENZA",null,null,null,null,null,1]
[null,"MIEDO",null,null,null,null,null,1]
[null,"REPUGNANCIA",null,null,null,null,null,1]
[null,"DESEO",null,null,null,null,null,1]
[null,"ESPERANZA",null,null,null,null,null,1]
[null,"ORGULLO",null,null,null,null,null,1]

{"sheet":"User09","index":9,"n_rows":112,"n_cols":13,"rows_kept":112,"cut":false,"hidden":false,"merged":[[98,1,99,1],[98,7,99,7],[44,1,45,1],[44,7,45,7],[62,1,63,1],[62,7,63,7],[80,1,81,1],[80,7,81,7],[0,1,0,17],[2,13,5,17],[10,1,11,1],[10,7,11,7],[27,1,28,1],[27,7,28,7]]}
[null,"ESTAS TABLAS UTILIZAN MACROS DE EXCEL, POR LO TANTO CUANDO SE LE CONSULTE AL ABRIR EL ARCHIVO DEBE ACEPTAR Y HABILITAR LAS MACROS PARA QUE FUNCIONEN CORRECTAMENTE"]
[]
[null,"VALORACIÓN EMOCIONAL DE PRODUCTOS, MATERIALES O SERVICIOS",null,null,null,null,null,null,"GÉNERO:",null,"EDAD:",null,"OBS:"]
[]
[null,"DÍGANOS COMO SE SIENTE RESPECTO A CADA PRODUCTO, MATERIAL O SERVICIO"]
[null,"· ESCOJA ENTRE 3 Y 5 EMOCIONES QUE UD. EXPERIMENTE CON MAYOR INTENSIDAD"]
[null,"· MARQUE CON UNA X LAS EMOCIONES Y LOS NIVELES DE INTENSIDAD ESCOGIDOS"]
[null,"· MARQUE SUS PREFERENCIAS CON UN DOBLE CLIC EN LA CELDA ESCOGIDA (PUEDE BORRAR DEL MISMO MODO)"]
[]
[]
[null,"EMOCIONES \\ INTENSIDAD","NADA","POCO","MEDIANAMENTE","BASTANTE","MUCHO","VALORACIÓN"]
[null,null,1.00000000001,2,3,4,5]
[null,{"$f":"User01!B13","v":"ALEGRÍA"},null,null,null,null,null,{"$f":"IF((SUMIF(C13:G13,\"X\",$C$12:$G$12)),(SUMIF(C13:G13,\"X\",$C$12:$G$12)), 1)","v":1}]
[null,{"$f":"User01!B14","v":"SATISFACCIÓN"},null,null,null,null,null,{"$f":"IF((SUMIF(C14:G14,\"X\",$C$12:$G$12)),(SUMIF(C14:G14,\"X\",$C$12:$G$12)), 1)","v":1}]
[null,{"$f":"User01!B15","v":"FASCINACIÓN"},null,null,null,null,null,1]
[null,{"$f":"User01!B16","v":"ABURRIMIENTO"},null,null,null,null,null,1]
[null,{"$f":"User01!B17","v":"ENFADO"},null,null,null,null,null,1]
[null,{"$f":"User01!B18","v":"TRISTEZA"},null,null,null,null,null,1]
[null,{"$f":"User01!B19","v":"VERGÜENZA"},null,null,null,null,null,1]
[null,{"$f":"User01!B20","v":"MIEDO"},null,null,null,null,null,1]
[null,{"$f":"User01!B21","v":"REPUGNANCIA"},null,null,null,null,null,1]
[null,{"$f":"User01!B22","v":"DESEO"},null,null,null,null,null,1]
[null,{"$f":"User01!B23","v":"ESPERANZA"},null,null,null,null,null,1]
[null,{"$f":"User01!B24","v":"ORGULLO"},null,null,null,null,null,1]
[]
[]
[]
[null,"EMOCIONES \\ INTENSIDAD","NADA","POCO","MEDIANAMENTE","BASTANTE","MUCHO","VALORACIÓN"]
[null,null,1.00000000001,2,3,4,5]
[null,{"$f":"$B13","v":"ALEGRÍA"},null,null,null,null,null,{"$f":"IF((SUMIF(C30:G30,\"X\",$C$29:$G$29)),(SUMIF(C30:G30,\"X\",$C$29:$G$29)), 1)","v":1}]
[null,"SATISFACCIÓN",null,null,null,null,null,{"$f":"IF((SUMIF(C31:G31,\"X\",$C$29:$G$29)),(SUMIF(C31:G31,\"X\",$C$29:$G$29)), 1)","v":1}]
[null,"FASCINACIÓN",null,null,null,null,null,1]
[null,"ABURRIMIENTO",null,null,null,null,null,1]
[null,"ENFADO",null,null,null,null,null,1]
[null,"TRISTEZA",null,null,null,null,null,1]
[null,"VERGÜENZA",null,null,null,null,null,1]
[null,"MIEDO",null,null,null,null,null,1]
[null,"REPUGNANCIA",null,null,null,null,null,1]
[null,"DESEO",null,null,null,null,null,1]
[null,"ESPERANZA",null,null,null,null,null,1]
[null,"ORGULLO",null,null,null,null,null,1]
[]
[]
[]
[null,"EMOCIONES \\ INTENSIDAD","NADA","POCO","MEDIANAMENTE","BASTANTE","MUCHO","VALORACIÓN"]
[null,null,1.00000000001,2,3,4,5]
[null,{"$f":"$B30","v":"ALEGRÍA"},null,null,null,null,null,{"$f":"IF((SUMIF(C47:G47,\"X\",$C$46:$G$46)),(SUMIF(C47:G47,\"X\",$C$46:$G$46)), 1)","v":1}]
[null,"SATISFACCIÓN",null,null,null,null,null,{"$f":"IF((SUMIF(C48:G48,\"X\",$C$46:$G$46)),(SUMIF(C48:G48,\"X\",$C$46:$G$46)), 1)","v":1}]
[null,"FASCINACIÓN",null,null,null,null,null,1]
[null,"ABURRIMIENTO",null,null,null,null,null,1]
[null,"ENFADO",null,null,null,null,null,1]
[null,"TRISTEZA",null,null,null,null,null,1]
[null,"VERGÜENZA",null,null,null,null,null,1]
[null,"MIEDO",null,null,null,null,null,1]
[null,"REPUGNANCIA",null,null,null,null,null,1]
[null,"DESEO",null,null,null,null,null,1]
[null,"ESPERANZA",null,null,null,null,null,1]
[null,"ORGULLO",null,null,null,null,null,1]
[]
[]
[]
[]
[null,"EMOCIONES \\ INTENSIDAD","NADA","POCO","MEDIANAMENTE","BASTANTE","MUCHO","VALORACIÓN"]
[null,null,1.00000000001,2,3,4,5]
[null,{"$f":"$B47","v":"ALEGRÍA"},null,null,null,null,null,{"$f":"IF((SUMIF(C65:G65,\"X\",$C$64:$G$64)),(SUMIF(C65:G65,\"X\",$C$64:$G$64)), 1)","v":1}]
[null,"SATISFACCIÓN",null,null,null,null,null,{"$f":"IF((SUMIF(C66:G66,\"X\",$C$64:$G$64)),(SUMIF(C66:G66,\"X\",$C$64:$G$64)), 1)","v":1}]
[null,"FASCINACIÓN",null,null,null,null,null,1]
[null,"ABURRIMIENTO",null,null,null,null,null,1]
[null,"ENFADO",null,null,null,null,null,1]
[null,"TRISTEZA",null,null,null,null,null,1]
[null,"VERGÜENZA",null,null,null,null,null,1]
[null,"MIEDO",null,null,null,null,null,1]
[null,"REPUGNANCIA",null,null,null,null,null,1]
[null,"DESEO",null,null,null,null,null,1]
[null,"ESPERANZA",null,null,null,null,null,1]
[null,"ORGULLO",null,null,null,null,null,1]
[]
[]
[]
[]
[null,"EMOCIONES \\ INTENSIDAD","NADA","POCO","MEDIANAMENTE","BASTANTE","MUCHO","VALORACIÓN"]
[null,null,1.00000000001,2,3,4,5]
[null,{"$f":"$B65","v":"ALEGRÍA"},null,null,null,null,null,{"$f":"IF((SUMIF(C83:G83,\"X\",$C$82:$G$82)),(SUMIF(C83:G83,\"X\",$C$82:$G$82)), 1)","v":1}]
[null,"SATISFACCIÓN",null,null,null,null,null,{"$f":"IF((SUMIF(C84:G84,\"X\",$C$82:$G$82)),(SUMIF(C84:G84,\"X\",$C$82:$G$82)), 1)","v":1}]
[null,"FASCINACIÓN",null,null,null,null,null,1]
[null,"ABURRIMIENTO",null,null,null,null,null,1]
[null,"ENFADO",null,null,null,null,null,1]
[null,"TRISTEZA",null,null,null,null,null,1]
[null,"VERGÜENZA",null,null,null,null,null,1]
[null,"MIEDO",null,null,null,null,null,1]
[null,"REPUGNANCIA",null,null,null,null,null,1]
[null,"DESEO",null,null,null,null,null,1]
[null,"ESPERANZA",null,null,null,null,null,1]
[null,"ORGULLO",null,null,null,null,null,1]
[]
[]
[]
[]
[null,"EMOCIONES \\ INTENSIDAD","NADA","POCO","MEDIANAMENTE","BASTANTE","MUCHO","VALORACIÓN"]
[null,null,1.00000000001,2,3,4,5]
[null,{"$f":"$B83","v":"ALEGRÍA"},null,null,null,null,null,{"$f":"IF((SUMIF(C101:G101,\"X\",$C$100:$G$100)),(SUMIF(C101:G101,\"X\",$C$100:$G$100)), 1)","v":1}]
[null,"SATISFACCIÓN",null,null,null,null,null,{"$f":"IF((SUMIF(C102:G102,\"X\",$C$100:$G$100)),(SUMIF(C102:G102,\"X\",$C$100:$G$100)), 1)","v":1}]
[null,"FASCINACIÓN",null,null,null,null,null,1]
[null,"ABURRIMIENTO",null,null,null,null,null,1]
[null,"ENFADO",null,null,null,null,null,1]
[null,"TRISTEZA",null,null,null,null,null,1]
[null,"VERGÜENZA",null,null,null,null,null,1]
[null,"MIEDO",null,null,null,null,null,1]
[null,"REPUGNANCIA",null,null,null,null,null,1]
[null,"DESEO",null,null,null,null,null,1]
[null,"ESPERANZA",null,null,null,null,null,1]
[null,"ORGULLO",null,null,null,null,null,1]

{"sheet":"User10","index":10,"n_rows":112,"n_cols":13,"rows_kept":112,"cut":false,"hidden":false,"merged":[[98,1,99,1],[98,7,99,7],[44,1,45,1],[44,7,45,7],[62,1,63,1],[62,7,63,7],[80,1,81,1],[80,7,81,7],[0,1,0,17],[2,13,5,17],[10,1,11,1],[10,7,11,7],[27,1,28,1],[27,7,28,7]]}
[null,"ESTAS TABLAS UTILIZAN MACROS DE EXCEL, POR LO TANTO CUANDO SE LE CONSULTE AL ABRIR EL ARCHIVO DEBE ACEPTAR Y HABILITAR LAS MACROS PARA QUE FUNCIONEN CORRECTAMENTE"]
[]
[null,"VALORACIÓN EMOCIONAL DE PRODUCTOS, MATERIALES O SERVICIOS",null,null,null,null,null,null,"GÉNERO:",null,"EDAD:",null,"OBS:"]
[]
[null,"DÍGANOS COMO SE SIENTE RESPECTO A CADA PRODUCTO, MATERIAL O SERVICIO"]
[null,"· ESCOJA ENTRE 3 Y 5 EMOCIONES QUE UD. EXPERIMENTE CON MAYOR INTENSIDAD"]
[null,"· MARQUE CON UNA X LAS EMOCIONES Y LOS NIVELES DE INTENSIDAD ESCOGIDOS"]
[null,"· MARQUE SUS PREFERENCIAS CON UN DOBLE CLIC EN LA CELDA ESCOGIDA (PUEDE BORRAR DEL MISMO MODO)"]
[]
[]
[null,"EMOCIONES \\ INTENSIDAD","NADA","POCO","MEDIANAMENTE","BASTANTE","MUCHO","VALORACIÓN"]
[null,null,1.00000000001,2,3,4,5]
[null,{"$f":"User01!B13","v":"ALEGRÍA"},null,null,null,null,null,{"$f":"IF((SUMIF(C13:G13,\"X\",$C$12:$G$12)),(SUMIF(C13:G13,\"X\",$C$12:$G$12)), 1)","v":1}]
[null,{"$f":"User01!B14","v":"SATISFACCIÓN"},null,null,null,null,null,{"$f":"IF((SUMIF(C14:G14,\"X\",$C$12:$G$12)),(SUMIF(C14:G14,\"X\",$C$12:$G$12)), 1)","v":1}]
[null,{"$f":"User01!B15","v":"FASCINACIÓN"},null,null,null,null,null,1]
[null,{"$f":"User01!B16","v":"ABURRIMIENTO"},null,null,null,null,null,1]
[null,{"$f":"User01!B17","v":"ENFADO"},null,null,null,null,null,1]
[null,{"$f":"User01!B18","v":"TRISTEZA"},null,null,null,null,null,1]
[null,{"$f":"User01!B19","v":"VERGÜENZA"},null,null,null,null,null,1]
[null,{"$f":"User01!B20","v":"MIEDO"},null,null,null,null,null,1]
[null,{"$f":"User01!B21","v":"REPUGNANCIA"},null,null,null,null,null,1]
[null,{"$f":"User01!B22","v":"DESEO"},null,null,null,null,null,1]
[null,{"$f":"User01!B23","v":"ESPERANZA"},null,null,null,null,null,1]
[null,{"$f":"User01!B24","v":"ORGULLO"},null,null,null,null,null,1]
[]
[]
[]
[null,"EMOCIONES \\ INTENSIDAD","NADA","POCO","MEDIANAMENTE","BASTANTE","MUCHO","VALORACIÓN"]
[null,null,1.00000000001,2,3,4,5]
[null,{"$f":"$B13","v":"ALEGRÍA"},null,null,null,null,null,{"$f":"IF((SUMIF(C30:G30,\"X\",$C$29:$G$29)),(SUMIF(C30:G30,\"X\",$C$29:$G$29)), 1)","v":1}]
[null,"SATISFACCIÓN",null,null,null,null,null,{"$f":"IF((SUMIF(C31:G31,\"X\",$C$29:$G$29)),(SUMIF(C31:G31,\"X\",$C$29:$G$29)), 1)","v":1}]
[null,"FASCINACIÓN",null,null,null,null,null,1]
[null,"ABURRIMIENTO",null,null,null,null,null,1]
[null,"ENFADO",null,null,null,null,null,1]
[null,"TRISTEZA",null,null,null,null,null,1]
[null,"VERGÜENZA",null,null,null,null,null,1]
[null,"MIEDO",null,null,null,null,null,1]
[null,"REPUGNANCIA",null,null,null,null,null,1]
[null,"DESEO",null,null,null,null,null,1]
[null,"ESPERANZA",null,null,null,null,null,1]
[null,"ORGULLO",null,null,null,null,null,1]
[]
[]
[]
[null,"EMOCIONES \\ INTENSIDAD","NADA","POCO","MEDIANAMENTE","BASTANTE","MUCHO","VALORACIÓN"]
[null,null,1.00000000001,2,3,4,5]
[null,{"$f":"$B30","v":"ALEGRÍA"},null,null,null,null,null,{"$f":"IF((SUMIF(C47:G47,\"X\",$C$46:$G$46)),(SUMIF(C47:G47,\"X\",$C$46:$G$46)), 1)","v":1}]
[null,"SATISFACCIÓN",null,null,null,null,null,{"$f":"IF((SUMIF(C48:G48,\"X\",$C$46:$G$46)),(SUMIF(C48:G48,\"X\",$C$46:$G$46)), 1)","v":1}]
[null,"FASCINACIÓN",null,null,null,null,null,1]
[null,"ABURRIMIENTO",null,null,null,null,null,1]
[null,"ENFADO",null,null,null,null,null,1]
[null,"TRISTEZA",null,null,null,null,null,1]
[null,"VERGÜENZA",null,null,null,null,null,1]
[null,"MIEDO",null,null,null,null,null,1]
[null,"REPUGNANCIA",null,null,null,null,null,1]
[null,"DESEO",null,null,null,null,null,1]
[null,"ESPERANZA",null,null,null,null,null,1]
[null,"ORGULLO",null,null,null,null,null,1]
[]
[]
[]
[]
[null,"EMOCIONES \\ INTENSIDAD","NADA","POCO","MEDIANAMENTE","BASTANTE","MUCHO","VALORACIÓN"]
[null,null,1.00000000001,2,3,4,5]
[null,{"$f":"$B47","v":"ALEGRÍA"},null,null,null,null,null,{"$f":"IF((SUMIF(C65:G65,\"X\",$C$64:$G$64)),(SUMIF(C65:G65,\"X\",$C$64:$G$64)), 1)","v":1}]
[null,"SATISFACCIÓN",null,null,null,null,null,{"$f":"IF((SUMIF(C66:G66,\"X\",$C$64:$G$64)),(SUMIF(C66:G66,\"X\",$C$64:$G$64)), 1)","v":1}]
[null,"FASCINACIÓN",null,null,null,null,null,1]
[null,"ABURRIMIENTO",null,null,null,null,null,1]
[null,"ENFADO",null,null,null,null,null,1]
[null,"TRISTEZA",null,null,null,null,null,1]
[null,"VERGÜENZA",null,null,null,null,null,1]
[null,"MIEDO",null,null,null,null,null,1]
[null,"REPUGNANCIA",null,null,null,null,null,1]
[null,"DESEO",null,null,null,null,null,1]
[null,"ESPERANZA",null,null,null,null,null,1]
[null,"ORGULLO",null,null,null,null,null,1]
[]
[]
[]
[]
[null,"EMOCIONES \\ INTENSIDAD","NADA","POCO","MEDIANAMENTE","BASTANTE","MUCHO","VALORACIÓN"]
[null,null,1.00000000001,2,3,4,5]
[null,{"$f":"$B65","v":"ALEGRÍA"},null,null,null,null,null,{"$f":"IF((SUMIF(C83:G83,\"X\",$C$82:$G$82)),(SUMIF(C83:G83,\"X\",$C$82:$G$82)), 1)","v":1}]
[null,"SATISFACCIÓN",null,null,null,null,null,{"$f":"IF((SUMIF(C84:G84,\"X\",$C$82:$G$82)),(SUMIF(C84:G84,\"X\",$C$82:$G$82)), 1)","v":1}]
[null,"FASCINACIÓN",null,null,null,null,null,1]
[null,"ABURRIMIENTO",null,null,null,null,null,1]
[null,"ENFADO",null,null,null,null,null,1]
[null,"TRISTEZA",null,null,null,null,null,1]
[null,"VERGÜENZA",null,null,null,null,null,1]
[null,"MIEDO",null,null,null,null,null,1]
[null,"REPUGNANCIA",null,null,null,null,null,1]
[null,"DESEO",null,null,null,null,null,1]
[null,"ESPERANZA",null,null,null,null,null,1]
[null,"ORGULLO",null,null,null,null,null,1]
[]
[]
[]
[]
[null,"EMOCIONES \\ INTENSIDAD","NADA","POCO","MEDIANAMENTE","BASTANTE","MUCHO","VALORACIÓN"]
[null,null,1.00000000001,2,3,4,5]
[null,{"$f":"$B83","v":"ALEGRÍA"},null,null,null,null,null,{"$f":"IF((SUMIF(C101:G101,\"X\",$C$100:$G$100)),(SUMIF(C101:G101,\"X\",$C$100:$G$100)), 1)","v":1}]
[null,"SATISFACCIÓN",null,null,null,null,null,{"$f":"IF((SUMIF(C102:G102,\"X\",$C$100:$G$100)),(SUMIF(C102:G102,\"X\",$C$100:$G$100)), 1)","v":1}]
[null,"FASCINACIÓN",null,null,null,null,null,1]
[null,"ABURRIMIENTO",null,null,null,null,null,1]
[null,"ENFADO",null,null,null,null,null,1]
[null,"TRISTEZA",null,null,null,null,null,1]
[null,"VERGÜENZA",null,null,null,null,null,1]
[null,"MIEDO",null,null,null,null,null,1]
[null,"REPUGNANCIA",null,null,null,null,null,1]
[null,"DESEO",null,null,null,null,null,1]
[null,"ESPERANZA",null,null,null,null,null,1]
[null,"ORGULLO",null,null,null,null,null,1]

{"sheet":"User11","index":11,"n_rows":112,"n_cols":13,"rows_kept":112,"cut":false,"hidden":false,"merged":[[98,1,99,1],[98,7,99,7],[44,1,45,1],[44,7,45,7],[62,1,63,1],[62,7,63,7],[80,1,81,1],[80,7,81,7],[0,1,0,17],[2,13,5,17],[10,1,11,1],[10,7,11,7],[27,1,28,1],[27,7,28,7]]}
[null,"ESTAS TABLAS UTILIZAN MACROS DE EXCEL, POR LO TANTO CUANDO SE LE CONSULTE AL ABRIR EL ARCHIVO DEBE ACEPTAR Y HABILITAR LAS MACROS PARA QUE FUNCIONEN CORRECTAMENTE"]
[]
[null,"VALORACIÓN EMOCIONAL DE PRODUCTOS, MATERIALES O SERVICIOS",null,null,null,null,null,null,"GÉNERO:",null,"EDAD:",null,"OBS:"]
[]
[null,"DÍGANOS COMO SE SIENTE RESPECTO A CADA PRODUCTO, MATERIAL O SERVICIO"]
[null,"· ESCOJA ENTRE 3 Y 5 EMOCIONES QUE UD. EXPERIMENTE CON MAYOR INTENSIDAD"]
[null,"· MARQUE CON UNA X LAS EMOCIONES Y LOS NIVELES DE INTENSIDAD ESCOGIDOS"]
[null,"· MARQUE SUS PREFERENCIAS CON UN DOBLE CLIC EN LA CELDA ESCOGIDA (PUEDE BORRAR DEL MISMO MODO)"]
[]
[]
[null,"EMOCIONES \\ INTENSIDAD","NADA","POCO","MEDIANAMENTE","BASTANTE","MUCHO","VALORACIÓN"]
[null,null,1.00000000001,2,3,4,5]
[null,{"$f":"User01!B13","v":"ALEGRÍA"},null,null,null,null,null,{"$f":"IF((SUMIF(C13:G13,\"X\",$C$12:$G$12)),(SUMIF(C13:G13,\"X\",$C$12:$G$12)), 1)","v":1}]
[null,{"$f":"User01!B14","v":"SATISFACCIÓN"},null,null,null,null,null,{"$f":"IF((SUMIF(C14:G14,\"X\",$C$12:$G$12)),(SUMIF(C14:G14,\"X\",$C$12:$G$12)), 1)","v":1}]
[null,{"$f":"User01!B15","v":"FASCINACIÓN"},null,null,null,null,null,1]
[null,{"$f":"User01!B16","v":"ABURRIMIENTO"},null,null,null,null,null,1]
[null,{"$f":"User01!B17","v":"ENFADO"},null,null,null,null,null,1]
[null,{"$f":"User01!B18","v":"TRISTEZA"},null,null,null,null,null,1]
[null,{"$f":"User01!B19","v":"VERGÜENZA"},null,null,null,null,null,1]
[null,{"$f":"User01!B20","v":"MIEDO"},null,null,null,null,null,1]
[null,{"$f":"User01!B21","v":"REPUGNANCIA"},null,null,null,null,null,1]
[null,{"$f":"User01!B22","v":"DESEO"},null,null,null,null,null,1]
[null,{"$f":"User01!B23","v":"ESPERANZA"},null,null,null,null,null,1]
[null,{"$f":"User01!B24","v":"ORGULLO"},null,null,null,null,null,1]
[]
[]
[]
[null,"EMOCIONES \\ INTENSIDAD","NADA","POCO","MEDIANAMENTE","BASTANTE","MUCHO","VALORACIÓN"]
[null,null,1.00000000001,2,3,4,5]
[null,{"$f":"$B13","v":"ALEGRÍA"},null,null,null,null,null,{"$f":"IF((SUMIF(C30:G30,\"X\",$C$29:$G$29)),(SUMIF(C30:G30,\"X\",$C$29:$G$29)), 1)","v":1}]
[null,"SATISFACCIÓN",null,null,null,null,null,{"$f":"IF((SUMIF(C31:G31,\"X\",$C$29:$G$29)),(SUMIF(C31:G31,\"X\",$C$29:$G$29)), 1)","v":1}]
[null,"FASCINACIÓN",null,null,null,null,null,1]
[null,"ABURRIMIENTO",null,null,null,null,null,1]
[null,"ENFADO",null,null,null,null,null,1]
[null,"TRISTEZA",null,null,null,null,null,1]
[null,"VERGÜENZA",null,null,null,null,null,1]
[null,"MIEDO",null,null,null,null,null,1]
[null,"REPUGNANCIA",null,null,null,null,null,1]
[null,"DESEO",null,null,null,null,null,1]
[null,"ESPERANZA",null,null,null,null,null,1]
[null,"ORGULLO",null,null,null,null,null,1]
[]
[]
[]
[null,"EMOCIONES \\ INTENSIDAD","NADA","POCO","MEDIANAMENTE","BASTANTE","MUCHO","VALORACIÓN"]
[null,null,1.00000000001,2,3,4,5]
[null,{"$f":"$B30","v":"ALEGRÍA"},null,null,null,null,null,{"$f":"IF((SUMIF(C47:G47,\"X\",$C$46:$G$46)),(SUMIF(C47:G47,\"X\",$C$46:$G$46)), 1)","v":1}]
[null,"SATISFACCIÓN",null,null,null,null,null,{"$f":"IF((SUMIF(C48:G48,\"X\",$C$46:$G$46)),(SUMIF(C48:G48,\"X\",$C$46:$G$46)), 1)","v":1}]
[null,"FASCINACIÓN",null,null,null,null,null,1]
[null,"ABURRIMIENTO",null,null,null,null,null,1]
[null,"ENFADO",null,null,null,null,null,1]
[null,"TRISTEZA",null,null,null,null,null,1]
[null,"VERGÜENZA",null,null,null,null,null,1]
[null,"MIEDO",null,null,null,null,null,1]
[null,"REPUGNANCIA",null,null,null,null,null,1]
[null,"DESEO",null,null,null,null,null,1]
[null,"ESPERANZA",null,null,null,null,null,1]
[null,"ORGULLO",null,null,null,null,null,1]
[]
[]
[]
[]
[null,"EMOCIONES \\ INTENSIDAD","NADA","POCO","MEDIANAMENTE","BASTANTE","MUCHO","VALORACIÓN"]
[null,null,1.00000000001,2,3,4,5]
[null,{"$f":"$B47","v":"ALEGRÍA"},null,null,null,null,null,{"$f":"IF((SUMIF(C65:G65,\"X\",$C$64:$G$64)),(SUMIF(C65:G65,\"X\",$C$64:$G$64)), 1)","v":1}]
[null,"SATISFACCIÓN",null,null,null,null,null,{"$f":"IF((SUMIF(C66:G66,\"X\",$C$64:$G$64)),(SUMIF(C66:G66,\"X\",$C$64:$G$64)), 1)","v":1}]
[null,"FASCINACIÓN",null,null,null,null,null,1]
[null,"ABURRIMIENTO",null,null,null,null,null,1]
[null,"ENFADO",null,null,null,null,null,1]
[null,"TRISTEZA",null,null,null,null,null,1]
[null,"VERGÜENZA",null,null,null,null,null,1]
[null,"MIEDO",null,null,null,null,null,1]
[null,"REPUGNANCIA",null,null,null,null,null,1]
[null,"DESEO",null,null,null,null,null,1]
[null,"ESPERANZA",null,null,null,null,null,1]
[null,"ORGULLO",null,null,null,null,null,1]
[]
[]
[]
[]
[null,"EMOCIONES \\ INTENSIDAD","NADA","POCO","MEDIANAMENTE","BASTANTE","MUCHO","VALORACIÓN"]
[null,null,1.00000000001,2,3,4,5]
[null,{"$f":"$B65","v":"ALEGRÍA"},null,null,null,null,null,{"$f":"IF((SUMIF(C83:G83,\"X\",$C$82:$G$82)),(SUMIF(C83:G83,\"X\",$C$82:$G$82)), 1)","v":1}]
[null,"SATISFACCIÓN",null,null,null,null,null,{"$f":"IF((SUMIF(C84:G84,\"X\",$C$82:$G$82)),(SUMIF(C84:G84,\"X\",$C$82:$G$82)), 1)","v":1}]
[null,"FASCINACIÓN",null,null,null,null,null,1]
[null,"ABURRIMIENTO",null,null,null,null,null,1]
[null,"ENFADO",null,null,null,null,null,1]
[null,"TRISTEZA",null,null,null,null,null,1]
[null,"VERGÜENZA",null,null,null,null,null,1]
[null,"MIEDO",null,null,null,null,null,1]
[null,"REPUGNANCIA",null,null,null,null,null,1]
[null,"DESEO",null,null,null,null,null,1]
[null,"ESPERANZA",null,null,null,null,null,1]
[null,"ORGULLO",null,null,null,null,null,1]
[]
[]
[]
[]
[null,"EMOCIONES \\ INTENSIDAD","NADA","POCO","MEDIANAMENTE","BASTANTE","MUCHO","VALORACIÓN"]
[null,null,1.00000000001,2,3,4,5]
[null,{"$f":"$B83","v":"ALEGRÍA"},null,null,null,null,null,{"$f":"IF((SUMIF(C101:G101,\"X\",$C$100:$G$100)),(SUMIF(C101:G101,\"X\",$C$100:$G$100)), 1)","v":1}]
[null,"SATISFACCIÓN",null,null,null,null,null,{"$f":"IF((SUMIF(C102:G102,\"X\",$C$100:$G$100)),(SUMIF(C102:G102,\"X\",$C$100:$G$100)), 1)","v":1}]
[null,"FASCINACIÓN",null,null,null,null,null,1]
[null,"ABURRIMIENTO",null,null,null,null,null,1]
[null,"ENFADO",null,null,null,null,null,1]
[null,"TRISTEZA",null,null,null,null,null,1]
[null,"VERGÜENZA",null,null,null,null,null,1]
[null,"MIEDO",null,null,null,null,null,1]
[null,"REPUGNANCIA",null,null,null,null,null,1]
[null,"DESEO",null,null,null,null,null,1]
[null,"ESPERANZA",null,null,null,null,null,1]
[null,"ORGULLO",null,null,null,null,null,1]

{"sheet":"User12","index":12,"n_rows":112,"n_cols":13,"rows_kept":112,"cut":false,"hidden":false,"merged":[[98,1,99,1],[98,7,99,7],[44,1,45,1],[44,7,45,7],[62,1,63,1],[62,7,63,7],[80,1,81,1],[80,7,81,7],[0,1,0,17],[2,13,5,17],[10,1,11,1],[10,7,11,7],[27,1,28,1],[27,7,28,7]]}
[null,"ESTAS TABLAS UTILIZAN MACROS DE EXCEL, POR LO TANTO CUANDO SE LE CONSULTE AL ABRIR EL ARCHIVO DEBE ACEPTAR Y HABILITAR LAS MACROS PARA QUE FUNCIONEN CORRECTAMENTE"]
[]
[null,"VALORACIÓN EMOCIONAL DE PRODUCTOS, MATERIALES O SERVICIOS",null,null,null,null,null,null,"GÉNERO:",null,"EDAD:",null,"OBS:"]
[]
[null,"DÍGANOS COMO SE SIENTE RESPECTO A CADA PRODUCTO, MATERIAL O SERVICIO"]
[null,"· ESCOJA ENTRE 3 Y 5 EMOCIONES QUE UD. EXPERIMENTE CON MAYOR INTENSIDAD"]
[null,"· MARQUE CON UNA X LAS EMOCIONES Y LOS NIVELES DE INTENSIDAD ESCOGIDOS"]
[null,"· MARQUE SUS PREFERENCIAS CON UN DOBLE CLIC EN LA CELDA ESCOGIDA (PUEDE BORRAR DEL MISMO MODO)"]
[]
[]
[null,"EMOCIONES \\ INTENSIDAD","NADA","POCO","MEDIANAMENTE","BASTANTE","MUCHO","VALORACIÓN"]
[null,null,1.00000000001,2,3,4,5]
[null,{"$f":"User01!B13","v":"ALEGRÍA"},null,null,null,null,null,{"$f":"IF((SUMIF(C13:G13,\"X\",$C$12:$G$12)),(SUMIF(C13:G13,\"X\",$C$12:$G$12)), 1)","v":1}]
[null,{"$f":"User01!B14","v":"SATISFACCIÓN"},null,null,null,null,null,{"$f":"IF((SUMIF(C14:G14,\"X\",$C$12:$G$12)),(SUMIF(C14:G14,\"X\",$C$12:$G$12)), 1)","v":1}]
[null,{"$f":"User01!B15","v":"FASCINACIÓN"},null,null,null,null,null,1]
[null,{"$f":"User01!B16","v":"ABURRIMIENTO"},null,null,null,null,null,1]
[null,{"$f":"User01!B17","v":"ENFADO"},null,null,null,null,null,1]
[null,{"$f":"User01!B18","v":"TRISTEZA"},null,null,null,null,null,1]
[null,{"$f":"User01!B19","v":"VERGÜENZA"},null,null,null,null,null,1]
[null,{"$f":"User01!B20","v":"MIEDO"},null,null,null,null,null,1]
[null,{"$f":"User01!B21","v":"REPUGNANCIA"},null,null,null,null,null,1]
[null,{"$f":"User01!B22","v":"DESEO"},null,null,null,null,null,1]
[null,{"$f":"User01!B23","v":"ESPERANZA"},null,null,null,null,null,1]
[null,{"$f":"User01!B24","v":"ORGULLO"},null,null,null,null,null,1]
[]
[]
[]
[null,"EMOCIONES \\ INTENSIDAD","NADA","POCO","MEDIANAMENTE","BASTANTE","MUCHO","VALORACIÓN"]
[null,null,1.00000000001,2,3,4,5]
[null,{"$f":"$B13","v":"ALEGRÍA"},null,null,null,null,null,{"$f":"IF((SUMIF(C30:G30,\"X\",$C$29:$G$29)),(SUMIF(C30:G30,\"X\",$C$29:$G$29)), 1)","v":1}]
[null,"SATISFACCIÓN",null,null,null,null,null,{"$f":"IF((SUMIF(C31:G31,\"X\",$C$29:$G$29)),(SUMIF(C31:G31,\"X\",$C$29:$G$29)), 1)","v":1}]
[null,"FASCINACIÓN",null,null,null,null,null,1]
[null,"ABURRIMIENTO",null,null,null,null,null,1]
[null,"ENFADO",null,null,null,null,null,1]
[null,"TRISTEZA",null,null,null,null,null,1]
[null,"VERGÜENZA",null,null,null,null,null,1]
[null,"MIEDO",null,null,null,null,null,1]
[null,"REPUGNANCIA",null,null,null,null,null,1]
[null,"DESEO",null,null,null,null,null,1]
[null,"ESPERANZA",null,null,null,null,null,1]
[null,"ORGULLO",null,null,null,null,null,1]
[]
[]
[]
[null,"EMOCIONES \\ INTENSIDAD","NADA","POCO","MEDIANAMENTE","BASTANTE","MUCHO","VALORACIÓN"]
[null,null,1.00000000001,2,3,4,5]
[null,{"$f":"$B30","v":"ALEGRÍA"},null,null,null,null,null,{"$f":"IF((SUMIF(C47:G47,\"X\",$C$46:$G$46)),(SUMIF(C47:G47,\"X\",$C$46:$G$46)), 1)","v":1}]
[null,"SATISFACCIÓN",null,null,null,null,null,{"$f":"IF((SUMIF(C48:G48,\"X\",$C$46:$G$46)),(SUMIF(C48:G48,\"X\",$C$46:$G$46)), 1)","v":1}]
[null,"FASCINACIÓN",null,null,null,null,null,1]
[null,"ABURRIMIENTO",null,null,null,null,null,1]
[null,"ENFADO",null,null,null,null,null,1]
[null,"TRISTEZA",null,null,null,null,null,1]
[null,"VERGÜENZA",null,null,null,null,null,1]
[null,"MIEDO",null,null,null,null,null,1]
[null,"REPUGNANCIA",null,null,null,null,null,1]
[null,"DESEO",null,null,null,null,null,1]
[null,"ESPERANZA",null,null,null,null,null,1]
[null,"ORGULLO",null,null,null,null,null,1]
[]
[]
[]
[]
[null,"EMOCIONES \\ INTENSIDAD","NADA","POCO","MEDIANAMENTE","BASTANTE","MUCHO","VALORACIÓN"]
[null,null,1.00000000001,2,3,4,5]
[null,{"$f":"$B47","v":"ALEGRÍA"},null,null,null,null,null,{"$f":"IF((SUMIF(C65:G65,\"X\",$C$64:$G$64)),(SUMIF(C65:G65,\"X\",$C$64:$G$64)), 1)","v":1}]
[null,"SATISFACCIÓN",null,null,null,null,null,{"$f":"IF((SUMIF(C66:G66,\"X\",$C$64:$G$64)),(SUMIF(C66:G66,\"X\",$C$64:$G$64)), 1)","v":1}]
[null,"FASCINACIÓN",null,null,null,null,null,1]
[null,"ABURRIMIENTO",null,null,null,null,null,1]
[null,"ENFADO",null,null,null,null,null,1]
[null,"TRISTEZA",null,null,null,null,null,1]
[null,"VERGÜENZA",null,null,null,null,null,1]
[null,"MIEDO",null,null,null,null,null,1]
[null,"REPUGNANCIA",null,null,null,null,null,1]
[null,"DESEO",null,null,null,null,null,1]
[null,"ESPERANZA",null,null,null,null,null,1]
[null,"ORGULLO",null,null,null,null,null,1]
[]
[]
[]
[]
[null,"EMOCIONES \\ INTENSIDAD","NADA","POCO","MEDIANAMENTE","BASTANTE","MUCHO","VALORACIÓN"]
[null,null,1.00000000001,2,3,4,5]
[null,{"$f":"$B65","v":"ALEGRÍA"},null,null,null,null,null,{"$f":"IF((SUMIF(C83:G83,\"X\",$C$82:$G$82)),(SUMIF(C83:G83,\"X\",$C$82:$G$82)), 1)","v":1}]
[null,"SATISFACCIÓN",null,null,null,null,null,{"$f":"IF((SUMIF(C84:G84,\"X\",$C$82:$G$82)),(SUMIF(C84:G84,\"X\",$C$82:$G$82)), 1)","v":1}]
[null,"FASCINACIÓN",null,null,null,null,null,1]
[null,"ABURRIMIENTO",null,null,null,null,null,1]
[null,"ENFADO",null,null,null,null,null,1]
[null,"TRISTEZA",null,null,null,null,null,1]
[null,"VERGÜENZA",null,null,null,null,null,1]
[null,"MIEDO",null,null,null,null,null,1]
[null,"REPUGNANCIA",null,null,null,null,null,1]
[null,"DESEO",null,null,null,null,null,1]
[null,"ESPERANZA",null,null,null,null,null,1]
[null,"ORGULLO",null,null,null,null,null,1]
[]
[]
[]
[]
[null,"EMOCIONES \\ INTENSIDAD","NADA","POCO","MEDIANAMENTE","BASTANTE","MUCHO","VALORACIÓN"]
[null,null,1.00000000001,2,3,4,5]
[null,{"$f":"$B83","v":"ALEGRÍA"},null,null,null,null,null,{"$f":"IF((SUMIF(C101:G101,\"X\",$C$100:$G$100)),(SUMIF(C101:G101,\"X\",$C$100:$G$100)), 1)","v":1}]
[null,"SATISFACCIÓN",null,null,null,null,null,{"$f":"IF((SUMIF(C102:G102,\"X\",$C$100:$G$100)),(SUMIF(C102:G102,\"X\",$C$100:$G$100)), 1)","v":1}]
[null,"FASCINACIÓN",null,null,null,null,null,1]
[null,"ABURRIMIENTO",null,null,null,null,null,1]
[null,"ENFADO",null,null,null,null,null,1]
[null,"TRISTEZA",null,null,null,null,null,1]
[null,"VERGÜENZA",null,null,null,null,null,1]
[null,"MIEDO",null,null,null,null,null,1]
[null,"REPUGNANCIA",null,null,null,null,null,1]
[null,"DESEO",null,null,null,null,null,1]
[null,"ESPERANZA",null,null,null,null,null,1]
[null,"ORGULLO",null,null,null,null,null,1]

{"sheet":"User13","index":13,"n_rows":112,"n_cols":13,"rows_kept":112,"cut":false,"hidden":false,"merged":[[98,1,99,1],[98,7,99,7],[44,1,45,1],[44,7,45,7],[62,1,63,1],[62,7,63,7],[80,1,81,1],[80,7,81,7],[0,1,0,17],[2,13,5,17],[10,1,11,1],[10,7,11,7],[27,1,28,1],[27,7,28,7]]}
[null,"ESTAS TABLAS UTILIZAN MACROS DE EXCEL, POR LO TANTO CUANDO SE LE CONSULTE AL ABRIR EL ARCHIVO DEBE ACEPTAR Y HABILITAR LAS MACROS PARA QUE FUNCIONEN CORRECTAMENTE"]
[]
[null,"VALORACIÓN EMOCIONAL DE PRODUCTOS, MATERIALES O SERVICIOS",null,null,null,null,null,null,"GÉNERO:",null,"EDAD:",null,"OBS:"]
[]
[null,"DÍGANOS COMO SE SIENTE RESPECTO A CADA PRODUCTO, MATERIAL O SERVICIO"]
[null,"· ESCOJA ENTRE 3 Y 5 EMOCIONES QUE UD. EXPERIMENTE CON MAYOR INTENSIDAD"]
[null,"· MARQUE CON UNA X LAS EMOCIONES Y LOS NIVELES DE INTENSIDAD ESCOGIDOS"]
[null,"· MARQUE SUS PREFERENCIAS CON UN DOBLE CLIC EN LA CELDA ESCOGIDA (PUEDE BORRAR DEL MISMO MODO)"]
[]
[]
[null,"EMOCIONES \\ INTENSIDAD","NADA","POCO","MEDIANAMENTE","BASTANTE","MUCHO","VALORACIÓN"]
[null,null,1.00000000001,2,3,4,5]
[null,{"$f":"User01!B13","v":"ALEGRÍA"},null,null,null,null,null,{"$f":"IF((SUMIF(C13:G13,\"X\",$C$12:$G$12)),(SUMIF(C13:G13,\"X\",$C$12:$G$12)), 1)","v":1}]
[null,{"$f":"User01!B14","v":"SATISFACCIÓN"},null,null,null,null,null,{"$f":"IF((SUMIF(C14:G14,\"X\",$C$12:$G$12)),(SUMIF(C14:G14,\"X\",$C$12:$G$12)), 1)","v":1}]
[null,{"$f":"User01!B15","v":"FASCINACIÓN"},null,null,null,null,null,1]
[null,{"$f":"User01!B16","v":"ABURRIMIENTO"},null,null,null,null,null,1]
[null,{"$f":"User01!B17","v":"ENFADO"},null,null,null,null,null,1]
[null,{"$f":"User01!B18","v":"TRISTEZA"},null,null,null,null,null,1]
[null,{"$f":"User01!B19","v":"VERGÜENZA"},null,null,null,null,null,1]
[null,{"$f":"User01!B20","v":"MIEDO"},null,null,null,null,null,1]
[null,{"$f":"User01!B21","v":"REPUGNANCIA"},null,null,null,null,null,1]
[null,{"$f":"User01!B22","v":"DESEO"},null,null,null,null,null,1]
[null,{"$f":"User01!B23","v":"ESPERANZA"},null,null,null,null,null,1]
[null,{"$f":"User01!B24","v":"ORGULLO"},null,null,null,null,null,1]
[]
[]
[]
[null,"EMOCIONES \\ INTENSIDAD","NADA","POCO","MEDIANAMENTE","BASTANTE","MUCHO","VALORACIÓN"]
[null,null,1.00000000001,2,3,4,5]
[null,{"$f":"$B13","v":"ALEGRÍA"},null,null,null,null,null,{"$f":"IF((SUMIF(C30:G30,\"X\",$C$29:$G$29)),(SUMIF(C30:G30,\"X\",$C$29:$G$29)), 1)","v":1}]
[null,"SATISFACCIÓN",null,null,null,null,null,{"$f":"IF((SUMIF(C31:G31,\"X\",$C$29:$G$29)),(SUMIF(C31:G31,\"X\",$C$29:$G$29)), 1)","v":1}]
[null,"FASCINACIÓN",null,null,null,null,null,1]
[null,"ABURRIMIENTO",null,null,null,null,null,1]
[null,"ENFADO",null,null,null,null,null,1]
[null,"TRISTEZA",null,null,null,null,null,1]
[null,"VERGÜENZA",null,null,null,null,null,1]
[null,"MIEDO",null,null,null,null,null,1]
[null,"REPUGNANCIA",null,null,null,null,null,1]
[null,"DESEO",null,null,null,null,null,1]
[null,"ESPERANZA",null,null,null,null,null,1]
[null,"ORGULLO",null,null,null,null,null,1]
[]
[]
[]
[null,"EMOCIONES \\ INTENSIDAD","NADA","POCO","MEDIANAMENTE","BASTANTE","MUCHO","VALORACIÓN"]
[null,null,1.00000000001,2,3,4,5]
[null,{"$f":"$B30","v":"ALEGRÍA"},null,null,null,null,null,{"$f":"IF((SUMIF(C47:G47,\"X\",$C$46:$G$46)),(SUMIF(C47:G47,\"X\",$C$46:$G$46)), 1)","v":1}]
[null,"SATISFACCIÓN",null,null,null,null,null,{"$f":"IF((SUMIF(C48:G48,\"X\",$C$46:$G$46)),(SUMIF(C48:G48,\"X\",$C$46:$G$46)), 1)","v":1}]
[null,"FASCINACIÓN",null,null,null,null,null,1]
[null,"ABURRIMIENTO",null,null,null,null,null,1]
[null,"ENFADO",null,null,null,null,null,1]
[null,"TRISTEZA",null,null,null,null,null,1]
[null,"VERGÜENZA",null,null,null,null,null,1]
[null,"MIEDO",null,null,null,null,null,1]
[null,"REPUGNANCIA",null,null,null,null,null,1]
[null,"DESEO",null,null,null,null,null,1]
[null,"ESPERANZA",null,null,null,null,null,1]
[null,"ORGULLO",null,null,null,null,null,1]
[]
[]
[]
[]
[null,"EMOCIONES \\ INTENSIDAD","NADA","POCO","MEDIANAMENTE","BASTANTE","MUCHO","VALORACIÓN"]
[null,null,1.00000000001,2,3,4,5]
[null,{"$f":"$B47","v":"ALEGRÍA"},null,null,null,null,null,{"$f":"IF((SUMIF(C65:G65,\"X\",$C$64:$G$64)),(SUMIF(C65:G65,\"X\",$C$64:$G$64)), 1)","v":1}]
[null,"SATISFACCIÓN",null,null,null,null,null,{"$f":"IF((SUMIF(C66:G66,\"X\",$C$64:$G$64)),(SUMIF(C66:G66,\"X\",$C$64:$G$64)), 1)","v":1}]
[null,"FASCINACIÓN",null,null,null,null,null,1]
[null,"ABURRIMIENTO",null,null,null,null,null,1]
[null,"ENFADO",null,null,null,null,null,1]
[null,"TRISTEZA",null,null,null,null,null,1]
[null,"VERGÜENZA",null,null,null,null,null,1]
[null,"MIEDO",null,null,null,null,null,1]
[null,"REPUGNANCIA",null,null,null,null,null,1]
[null,"DESEO",null,null,null,null,null,1]
[null,"ESPERANZA",null,null,null,null,null,1]
[null,"ORGULLO",null,null,null,null,null,1]
[]
[]
[]
[]
[null,"EMOCIONES \\ INTENSIDAD","NADA","POCO","MEDIANAMENTE","BASTANTE","MUCHO","VALORACIÓN"]
[null,null,1.00000000001,2,3,4,5]
[null,{"$f":"$B65","v":"ALEGRÍA"},null,null,null,null,null,{"$f":"IF((SUMIF(C83:G83,\"X\",$C$82:$G$82)),(SUMIF(C83:G83,\"X\",$C$82:$G$82)), 1)","v":1}]
[null,"SATISFACCIÓN",null,null,null,null,null,{"$f":"IF((SUMIF(C84:G84,\"X\",$C$82:$G$82)),(SUMIF(C84:G84,\"X\",$C$82:$G$82)), 1)","v":1}]
[null,"FASCINACIÓN",null,null,null,null,null,1]
[null,"ABURRIMIENTO",null,null,null,null,null,1]
[null,"ENFADO",null,null,null,null,null,1]
[null,"TRISTEZA",null,null,null,null,null,1]
[null,"VERGÜENZA",null,null,null,null,null,1]
[null,"MIEDO",null,null,null,null,null,1]
[null,"REPUGNANCIA",null,null,null,null,null,1]
[null,"DESEO",null,null,null,null,null,1]
[null,"ESPERANZA",null,null,null,null,null,1]
[null,"ORGULLO",null,null,null,null,null,1]
[]
[]
[]
[]
[null,"EMOCIONES \\ INTENSIDAD","NADA","POCO","MEDIANAMENTE","BASTANTE","MUCHO","VALORACIÓN"]
[null,null,1.00000000001,2,3,4,5]
[null,{"$f":"$B83","v":"ALEGRÍA"},null,null,null,null,null,{"$f":"IF((SUMIF(C101:G101,\"X\",$C$100:$G$100)),(SUMIF(C101:G101,\"X\",$C$100:$G$100)), 1)","v":1}]
[null,"SATISFACCIÓN",null,null,null,null,null,{"$f":"IF((SUMIF(C102:G102,\"X\",$C$100:$G$100)),(SUMIF(C102:G102,\"X\",$C$100:$G$100)), 1)","v":1}]
[null,"FASCINACIÓN",null,null,null,null,null,1]
[null,"ABURRIMIENTO",null,null,null,null,null,1]
[null,"ENFADO",null,null,null,null,null,1]
[null,"TRISTEZA",null,null,null,null,null,1]
[null,"VERGÜENZA",null,null,null,null,null,1]
[null,"MIEDO",null,null,null,null,null,1]
[null,"REPUGNANCIA",null,null,null,null,null,1]
[null,"DESEO",null,null,null,null,null,1]
[null,"ESPERANZA",null,null,null,null,null,1]
[null,"ORGULLO",null,null,null,null,null,1]

{"sheet":"User14","index":14,"n_rows":112,"n_cols":13,"rows_kept":112,"cut":false,"hidden":false,"merged":[[98,1,99,1],[98,7,99,7],[44,1,45,1],[44,7,45,7],[62,1,63,1],[62,7,63,7],[80,1,81,1],[80,7,81,7],[0,1,0,17],[2,13,5,17],[10,1,11,1],[10,7,11,7],[27,1,28,1],[27,7,28,7]]}
[null,"ESTAS TABLAS UTILIZAN MACROS DE EXCEL, POR LO TANTO CUANDO SE LE CONSULTE AL ABRIR EL ARCHIVO DEBE ACEPTAR Y HABILITAR LAS MACROS PARA QUE FUNCIONEN CORRECTAMENTE"]
[]
[null,"VALORACIÓN EMOCIONAL DE PRODUCTOS, MATERIALES O SERVICIOS",null,null,null,null,null,null,"GÉNERO:",null,"EDAD:",null,"OBS:"]
[]
[null,"DÍGANOS COMO SE SIENTE RESPECTO A CADA PRODUCTO, MATERIAL O SERVICIO"]
[null,"· ESCOJA ENTRE 3 Y 5 EMOCIONES QUE UD. EXPERIMENTE CON MAYOR INTENSIDAD"]
[null,"· MARQUE CON UNA X LAS EMOCIONES Y LOS NIVELES DE INTENSIDAD ESCOGIDOS"]
[null,"· MARQUE SUS PREFERENCIAS CON UN DOBLE CLIC EN LA CELDA ESCOGIDA (PUEDE BORRAR DEL MISMO MODO)"]
[]
[]
[null,"EMOCIONES \\ INTENSIDAD","NADA","POCO","MEDIANAMENTE","BASTANTE","MUCHO","VALORACIÓN"]
[null,null,1.00000000001,2,3,4,5]
[null,{"$f":"User01!B13","v":"ALEGRÍA"},null,null,null,null,null,{"$f":"IF((SUMIF(C13:G13,\"X\",$C$12:$G$12)),(SUMIF(C13:G13,\"X\",$C$12:$G$12)), 1)","v":1}]
[null,{"$f":"User01!B14","v":"SATISFACCIÓN"},null,null,null,null,null,{"$f":"IF((SUMIF(C14:G14,\"X\",$C$12:$G$12)),(SUMIF(C14:G14,\"X\",$C$12:$G$12)), 1)","v":1}]
[null,{"$f":"User01!B15","v":"FASCINACIÓN"},null,null,null,null,null,1]
[null,{"$f":"User01!B16","v":"ABURRIMIENTO"},null,null,null,null,null,1]
[null,{"$f":"User01!B17","v":"ENFADO"},null,null,null,null,null,1]
[null,{"$f":"User01!B18","v":"TRISTEZA"},null,null,null,null,null,1]
[null,{"$f":"User01!B19","v":"VERGÜENZA"},null,null,null,null,null,1]
[null,{"$f":"User01!B20","v":"MIEDO"},null,null,null,null,null,1]
[null,{"$f":"User01!B21","v":"REPUGNANCIA"},null,null,null,null,null,1]
[null,{"$f":"User01!B22","v":"DESEO"},null,null,null,null,null,1]
[null,{"$f":"User01!B23","v":"ESPERANZA"},null,null,null,null,null,1]
[null,{"$f":"User01!B24","v":"ORGULLO"},null,null,null,null,null,1]
[]
[]
[]
[null,"EMOCIONES \\ INTENSIDAD","NADA","POCO","MEDIANAMENTE","BASTANTE","MUCHO","VALORACIÓN"]
[null,null,1.00000000001,2,3,4,5]
[null,{"$f":"$B13","v":"ALEGRÍA"},null,null,null,null,null,{"$f":"IF((SUMIF(C30:G30,\"X\",$C$29:$G$29)),(SUMIF(C30:G30,\"X\",$C$29:$G$29)), 1)","v":1}]
[null,"SATISFACCIÓN",null,null,null,null,null,{"$f":"IF((SUMIF(C31:G31,\"X\",$C$29:$G$29)),(SUMIF(C31:G31,\"X\",$C$29:$G$29)), 1)","v":1}]
[null,"FASCINACIÓN",null,null,null,null,null,1]
[null,"ABURRIMIENTO",null,null,null,null,null,1]
[null,"ENFADO",null,null,null,null,null,1]
[null,"TRISTEZA",null,null,null,null,null,1]
[null,"VERGÜENZA",null,null,null,null,null,1]
[null,"MIEDO",null,null,null,null,null,1]
[null,"REPUGNANCIA",null,null,null,null,null,1]
[null,"DESEO",null,null,null,null,null,1]
[null,"ESPERANZA",null,null,null,null,null,1]
[null,"ORGULLO",null,null,null,null,null,1]
[]
[]
[]
[null,"EMOCIONES \\ INTENSIDAD","NADA","POCO","MEDIANAMENTE","BASTANTE","MUCHO","VALORACIÓN"]
[null,null,1.00000000001,2,3,4,5]
[null,{"$f":"$B30","v":"ALEGRÍA"},null,null,null,null,null,{"$f":"IF((SUMIF(C47:G47,\"X\",$C$46:$G$46)),(SUMIF(C47:G47,\"X\",$C$46:$G$46)), 1)","v":1}]
[null,"SATISFACCIÓN",null,null,null,null,null,{"$f":"IF((SUMIF(C48:G48,\"X\",$C$46:$G$46)),(SUMIF(C48:G48,\"X\",$C$46:$G$46)), 1)","v":1}]
[null,"FASCINACIÓN",null,null,null,null,null,1]
[null,"ABURRIMIENTO",null,null,null,null,null,1]
[null,"ENFADO",null,null,null,null,null,1]
[null,"TRISTEZA",null,null,null,null,null,1]
[null,"VERGÜENZA",null,null,null,null,null,1]
[null,"MIEDO",null,null,null,null,null,1]
[null,"REPUGNANCIA",null,null,null,null,null,1]
[null,"DESEO",null,null,null,null,null,1]
[null,"ESPERANZA",null,null,null,null,null,1]
[null,"ORGULLO",null,null,null,null,null,1]
[]
[]
[]
[]
[null,"EMOCIONES \\ INTENSIDAD","NADA","POCO","MEDIANAMENTE","BASTANTE","MUCHO","VALORACIÓN"]
[null,null,1.00000000001,2,3,4,5]
[null,{"$f":"$B47","v":"ALEGRÍA"},null,null,null,null,null,{"$f":"IF((SUMIF(C65:G65,\"X\",$C$64:$G$64)),(SUMIF(C65:G65,\"X\",$C$64:$G$64)), 1)","v":1}]
[null,"SATISFACCIÓN",null,null,null,null,null,{"$f":"IF((SUMIF(C66:G66,\"X\",$C$64:$G$64)),(SUMIF(C66:G66,\"X\",$C$64:$G$64)), 1)","v":1}]
[null,"FASCINACIÓN",null,null,null,null,null,1]
[null,"ABURRIMIENTO",null,null,null,null,null,1]
[null,"ENFADO",null,null,null,null,null,1]
[null,"TRISTEZA",null,null,null,null,null,1]
[null,"VERGÜENZA",null,null,null,null,null,1]
[null,"MIEDO",null,null,null,null,null,1]
[null,"REPUGNANCIA",null,null,null,null,null,1]
[null,"DESEO",null,null,null,null,null,1]
[null,"ESPERANZA",null,null,null,null,null,1]
[null,"ORGULLO",null,null,null,null,null,1]
[]
[]
[]
[]
[null,"EMOCIONES \\ INTENSIDAD","NADA","POCO","MEDIANAMENTE","BASTANTE","MUCHO","VALORACIÓN"]
[null,null,1.00000000001,2,3,4,5]
[null,{"$f":"$B65","v":"ALEGRÍA"},null,null,null,null,null,{"$f":"IF((SUMIF(C83:G83,\"X\",$C$82:$G$82)),(SUMIF(C83:G83,\"X\",$C$82:$G$82)), 1)","v":1}]
[null,"SATISFACCIÓN",null,null,null,null,null,{"$f":"IF((SUMIF(C84:G84,\"X\",$C$82:$G$82)),(SUMIF(C84:G84,\"X\",$C$82:$G$82)), 1)","v":1}]
[null,"FASCINACIÓN",null,null,null,null,null,1]
[null,"ABURRIMIENTO",null,null,null,null,null,1]
[null,"ENFADO",null,null,null,null,null,1]
[null,"TRISTEZA",null,null,null,null,null,1]
[null,"VERGÜENZA",null,null,null,null,null,1]
[null,"MIEDO",null,null,null,null,null,1]
[null,"REPUGNANCIA",null,null,null,null,null,1]
[null,"DESEO",null,null,null,null,null,1]
[null,"ESPERANZA",null,null,null,null,null,1]
[null,"ORGULLO",null,null,null,null,null,1]
[]
[]
[]
[]
[null,"EMOCIONES \\ INTENSIDAD","NADA","POCO","MEDIANAMENTE","BASTANTE","MUCHO","VALORACIÓN"]
[null,null,1.00000000001,2,3,4,5]
[null,{"$f":"$B83","v":"ALEGRÍA"},null,null,null,null,null,{"$f":"IF((SUMIF(C101:G101,\"X\",$C$100:$G$100)),(SUMIF(C101:G101,\"X\",$C$100:$G$100)), 1)","v":1}]
[null,"SATISFACCIÓN",null,null,null,null,null,{"$f":"IF((SUMIF(C102:G102,\"X\",$C$100:$G$100)),(SUMIF(C102:G102,\"X\",$C$100:$G$100)), 1)","v":1}]
[null,"FASCINACIÓN",null,null,null,null,null,1]
[null,"ABURRIMIENTO",null,null,null,null,null,1]
[null,"ENFADO",null,null,null,null,null,1]
[null,"TRISTEZA",null,null,null,null,null,1]
[null,"VERGÜENZA",null,null,null,null,null,1]
[null,"MIEDO",null,null,null,null,null,1]
[null,"REPUGNANCIA",null,null,null,null,null,1]
[null,"DESEO",null,null,null,null,null,1]
[null,"ESPERANZA",null,null,null,null,null,1]
[null,"ORGULLO",null,null,null,null,null,1]

{"sheet":"User15","index":15,"n_rows":112,"n_cols":13,"rows_kept":112,"cut":false,"hidden":false,"merged":[[98,1,99,1],[98,7,99,7],[44,1,45,1],[44,7,45,7],[62,1,63,1],[62,7,63,7],[80,1,81,1],[80,7,81,7],[0,1,0,17],[2,13,5,17],[10,1,11,1],[10,7,11,7],[27,1,28,1],[27,7,28,7]]}
[null,"ESTAS TABLAS UTILIZAN MACROS DE EXCEL, POR LO TANTO CUANDO SE LE CONSULTE AL ABRIR EL ARCHIVO DEBE ACEPTAR Y HABILITAR LAS MACROS PARA QUE FUNCIONEN CORRECTAMENTE"]
[]
[null,"VALORACIÓN EMOCIONAL DE PRODUCTOS, MATERIALES O SERVICIOS",null,null,null,null,null,null,"GÉNERO:",null,"EDAD:",null,"OBS:"]
[]
[null,"DÍGANOS COMO SE SIENTE RESPECTO A CADA PRODUCTO, MATERIAL O SERVICIO"]
[null,"· ESCOJA ENTRE 3 Y 5 EMOCIONES QUE UD. EXPERIMENTE CON MAYOR INTENSIDAD"]
[null,"· MARQUE CON UNA X LAS EMOCIONES Y LOS NIVELES DE INTENSIDAD ESCOGIDOS"]
[null,"· MARQUE SUS PREFERENCIAS CON UN DOBLE CLIC EN LA CELDA ESCOGIDA (PUEDE BORRAR DEL MISMO MODO)"]
[]
[]
[null,"EMOCIONES \\ INTENSIDAD","NADA","POCO","MEDIANAMENTE","BASTANTE","MUCHO","VALORACIÓN"]
[null,null,1.00000000001,2,3,4,5]
[null,{"$f":"User01!B13","v":"ALEGRÍA"},null,null,null,null,null,{"$f":"IF((SUMIF(C13:G13,\"X\",$C$12:$G$12)),(SUMIF(C13:G13,\"X\",$C$12:$G$12)), 1)","v":1}]
[null,{"$f":"User01!B14","v":"SATISFACCIÓN"},null,null,null,null,null,{"$f":"IF((SUMIF(C14:G14,\"X\",$C$12:$G$12)),(SUMIF(C14:G14,\"X\",$C$12:$G$12)), 1)","v":1}]
[null,{"$f":"User01!B15","v":"FASCINACIÓN"},null,null,null,null,null,1]
[null,{"$f":"User01!B16","v":"ABURRIMIENTO"},null,null,null,null,null,1]
[null,{"$f":"User01!B17","v":"ENFADO"},null,null,null,null,null,1]
[null,{"$f":"User01!B18","v":"TRISTEZA"},null,null,null,null,null,1]
[null,{"$f":"User01!B19","v":"VERGÜENZA"},null,null,null,null,null,1]
[null,{"$f":"User01!B20","v":"MIEDO"},null,null,null,null,null,1]
[null,{"$f":"User01!B21","v":"REPUGNANCIA"},null,null,null,null,null,1]
[null,{"$f":"User01!B22","v":"DESEO"},null,null,null,null,null,1]
[null,{"$f":"User01!B23","v":"ESPERANZA"},null,null,null,null,null,1]
[null,{"$f":"User01!B24","v":"ORGULLO"},null,null,null,null,null,1]
[]
[]
[]
[null,"EMOCIONES \\ INTENSIDAD","NADA","POCO","MEDIANAMENTE","BASTANTE","MUCHO","VALORACIÓN"]
[null,null,1.00000000001,2,3,4,5]
[null,{"$f":"$B13","v":"ALEGRÍA"},null,null,null,null,null,{"$f":"IF((SUMIF(C30:G30,\"X\",$C$29:$G$29)),(SUMIF(C30:G30,\"X\",$C$29:$G$29)), 1)","v":1}]
[null,"SATISFACCIÓN",null,null,null,null,null,{"$f":"IF((SUMIF(C31:G31,\"X\",$C$29:$G$29)),(SUMIF(C31:G31,\"X\",$C$29:$G$29)), 1)","v":1}]
[null,"FASCINACIÓN",null,null,null,null,null,1]
[null,"ABURRIMIENTO",null,null,null,null,null,1]
[null,"ENFADO",null,null,null,null,null,1]
[null,"TRISTEZA",null,null,null,null,null,1]
[null,"VERGÜENZA",null,null,null,null,null,1]
[null,"MIEDO",null,null,null,null,null,1]
[null,"REPUGNANCIA",null,null,null,null,null,1]
[null,"DESEO",null,null,null,null,null,1]
[null,"ESPERANZA",null,null,null,null,null,1]
[null,"ORGULLO",null,null,null,null,null,1]
[]
[]
[]
[null,"EMOCIONES \\ INTENSIDAD","NADA","POCO","MEDIANAMENTE","BASTANTE","MUCHO","VALORACIÓN"]
[null,null,1.00000000001,2,3,4,5]
[null,{"$f":"$B30","v":"ALEGRÍA"},null,null,null,null,null,{"$f":"IF((SUMIF(C47:G47,\"X\",$C$46:$G$46)),(SUMIF(C47:G47,\"X\",$C$46:$G$46)), 1)","v":1}]
[null,"SATISFACCIÓN",null,null,null,null,null,{"$f":"IF((SUMIF(C48:G48,\"X\",$C$46:$G$46)),(SUMIF(C48:G48,\"X\",$C$46:$G$46)), 1)","v":1}]
[null,"FASCINACIÓN",null,null,null,null,null,1]
[null,"ABURRIMIENTO",null,null,null,null,null,1]
[null,"ENFADO",null,null,null,null,null,1]
[null,"TRISTEZA",null,null,null,null,null,1]
[null,"VERGÜENZA",null,null,null,null,null,1]
[null,"MIEDO",null,null,null,null,null,1]
[null,"REPUGNANCIA",null,null,null,null,null,1]
[null,"DESEO",null,null,null,null,null,1]
[null,"ESPERANZA",null,null,null,null,null,1]
[null,"ORGULLO",null,null,null,null,null,1]
[]
[]
[]
[]
[null,"EMOCIONES \\ INTENSIDAD","NADA","POCO","MEDIANAMENTE","BASTANTE","MUCHO","VALORACIÓN"]
[null,null,1.00000000001,2,3,4,5]
[null,{"$f":"$B47","v":"ALEGRÍA"},null,null,null,null,null,{"$f":"IF((SUMIF(C65:G65,\"X\",$C$64:$G$64)),(SUMIF(C65:G65,\"X\",$C$64:$G$64)), 1)","v":1}]
[null,"SATISFACCIÓN",null,null,null,null,null,{"$f":"IF((SUMIF(C66:G66,\"X\",$C$64:$G$64)),(SUMIF(C66:G66,\"X\",$C$64:$G$64)), 1)","v":1}]
[null,"FASCINACIÓN",null,null,null,null,null,1]
[null,"ABURRIMIENTO",null,null,null,null,null,1]
[null,"ENFADO",null,null,null,null,null,1]
[null,"TRISTEZA",null,null,null,null,null,1]
[null,"VERGÜENZA",null,null,null,null,null,1]
[null,"MIEDO",null,null,null,null,null,1]
[null,"REPUGNANCIA",null,null,null,null,null,1]
[null,"DESEO",null,null,null,null,null,1]
[null,"ESPERANZA",null,null,null,null,null,1]
[null,"ORGULLO",null,null,null,null,null,1]
[]
[]
[]
[]
[null,"EMOCIONES \\ INTENSIDAD","NADA","POCO","MEDIANAMENTE","BASTANTE","MUCHO","VALORACIÓN"]
[null,null,1.00000000001,2,3,4,5]
[null,{"$f":"$B65","v":"ALEGRÍA"},null,null,null,null,null,{"$f":"IF((SUMIF(C83:G83,\"X\",$C$82:$G$82)),(SUMIF(C83:G83,\"X\",$C$82:$G$82)), 1)","v":1}]
[null,"SATISFACCIÓN",null,null,null,null,null,{"$f":"IF((SUMIF(C84:G84,\"X\",$C$82:$G$82)),(SUMIF(C84:G84,\"X\",$C$82:$G$82)), 1)","v":1}]
[null,"FASCINACIÓN",null,null,null,null,null,1]
[null,"ABURRIMIENTO",null,null,null,null,null,1]
[null,"ENFADO",null,null,null,null,null,1]
[null,"TRISTEZA",null,null,null,null,null,1]
[null,"VERGÜENZA",null,null,null,null,null,1]
[null,"MIEDO",null,null,null,null,null,1]
[null,"REPUGNANCIA",null,null,null,null,null,1]
[null,"DESEO",null,null,null,null,null,1]
[null,"ESPERANZA",null,null,null,null,null,1]
[null,"ORGULLO",null,null,null,null,null,1]
[]
[]
[]
[]
[null,"EMOCIONES \\ INTENSIDAD","NADA","POCO","MEDIANAMENTE","BASTANTE","MUCHO","VALORACIÓN"]
[null,null,1.00000000001,2,3,4,5]
[null,{"$f":"$B83","v":"ALEGRÍA"},null,null,null,null,null,{"$f":"IF((SUMIF(C101:G101,\"X\",$C$100:$G$100)),(SUMIF(C101:G101,\"X\",$C$100:$G$100)), 1)","v":1}]
[null,"SATISFACCIÓN",null,null,null,null,null,{"$f":"IF((SUMIF(C102:G102,\"X\",$C$100:$G$100)),(SUMIF(C102:G102,\"X\",$C$100:$G$100)), 1)","v":1}]
[null,"FASCINACIÓN",null,null,null,null,null,1]
[null,"ABURRIMIENTO",null,null,null,null,null,1]
[null,"ENFADO",null,null,null,null,null,1]
[null,"TRISTEZA",null,null,null,null,null,1]
[null,"VERGÜENZA",null,null,null,null,null,1]
[null,"MIEDO",null,null,null,null,null,1]
[null,"REPUGNANCIA",null,null,null,null,null,1]
[null,"DESEO",null,null,null,null,null,1]
[null,"ESPERANZA",null,null,null,null,null,1]
[null,"ORGULLO",null,null,null,null,null,1]

{"sheet":"User16","index":16,"n_rows":112,"n_cols":13,"rows_kept":112,"cut":false,"hidden":false,"merged":[[98,1,99,1],[98,7,99,7],[44,1,45,1],[44,7,45,7],[62,1,63,1],[62,7,63,7],[80,1,81,1],[80,7,81,7],[0,1,0,17],[2,13,5,17],[10,1,11,1],[10,7,11,7],[27,1,28,1],[27,7,28,7]]}
[null,"ESTAS TABLAS UTILIZAN MACROS DE EXCEL, POR LO TANTO CUANDO SE LE CONSULTE AL ABRIR EL ARCHIVO DEBE ACEPTAR Y HABILITAR LAS MACROS PARA QUE FUNCIONEN CORRECTAMENTE"]
[]
[null,"VALORACIÓN EMOCIONAL DE PRODUCTOS, MATERIALES O SERVICIOS",null,null,null,null,null,null,"GÉNERO:",null,"EDAD:",null,"OBS:"]
[]
[null,"DÍGANOS COMO SE SIENTE RESPECTO A CADA PRODUCTO, MATERIAL O SERVICIO"]
[null,"· ESCOJA ENTRE 3 Y 5 EMOCIONES QUE UD. EXPERIMENTE CON MAYOR INTENSIDAD"]
[null,"· MARQUE CON UNA X LAS EMOCIONES Y LOS NIVELES DE INTENSIDAD ESCOGIDOS"]
[null,"· MARQUE SUS PREFERENCIAS CON UN DOBLE CLIC EN LA CELDA ESCOGIDA (PUEDE BORRAR DEL MISMO MODO)"]
[]
[]
[null,"EMOCIONES \\ INTENSIDAD","NADA","POCO","MEDIANAMENTE","BASTANTE","MUCHO","VALORACIÓN"]
[null,null,1.00000000001,2,3,4,5]
[null,{"$f":"User01!B13","v":"ALEGRÍA"},null,null,null,null,null,{"$f":"IF((SUMIF(C13:G13,\"X\",$C$12:$G$12)),(SUMIF(C13:G13,\"X\",$C$12:$G$12)), 1)","v":1}]
[null,{"$f":"User01!B14","v":"SATISFACCIÓN"},null,null,null,null,null,{"$f":"IF((SUMIF(C14:G14,\"X\",$C$12:$G$12)),(SUMIF(C14:G14,\"X\",$C$12:$G$12)), 1)","v":1}]
[null,{"$f":"User01!B15","v":"FASCINACIÓN"},null,null,null,null,null,1]
[null,{"$f":"User01!B16","v":"ABURRIMIENTO"},null,null,null,null,null,1]
[null,{"$f":"User01!B17","v":"ENFADO"},null,null,null,null,null,1]
[null,{"$f":"User01!B18","v":"TRISTEZA"},null,null,null,null,null,1]
[null,{"$f":"User01!B19","v":"VERGÜENZA"},null,null,null,null,null,1]
[null,{"$f":"User01!B20","v":"MIEDO"},null,null,null,null,null,1]
[null,{"$f":"User01!B21","v":"REPUGNANCIA"},null,null,null,null,null,1]
[null,{"$f":"User01!B22","v":"DESEO"},null,null,null,null,null,1]
[null,{"$f":"User01!B23","v":"ESPERANZA"},null,null,null,null,null,1]
[null,{"$f":"User01!B24","v":"ORGULLO"},null,null,null,null,null,1]
[]
[]
[]
[null,"EMOCIONES \\ INTENSIDAD","NADA","POCO","MEDIANAMENTE","BASTANTE","MUCHO","VALORACIÓN"]
[null,null,1.00000000001,2,3,4,5]
[null,{"$f":"$B13","v":"ALEGRÍA"},null,null,null,null,null,{"$f":"IF((SUMIF(C30:G30,\"X\",$C$29:$G$29)),(SUMIF(C30:G30,\"X\",$C$29:$G$29)), 1)","v":1}]
[null,"SATISFACCIÓN",null,null,null,null,null,{"$f":"IF((SUMIF(C31:G31,\"X\",$C$29:$G$29)),(SUMIF(C31:G31,\"X\",$C$29:$G$29)), 1)","v":1}]
[null,"FASCINACIÓN",null,null,null,null,null,1]
[null,"ABURRIMIENTO",null,null,null,null,null,1]
[null,"ENFADO",null,null,null,null,null,1]
[null,"TRISTEZA",null,null,null,null,null,1]
[null,"VERGÜENZA",null,null,null,null,null,1]
[null,"MIEDO",null,null,null,null,null,1]
[null,"REPUGNANCIA",null,null,null,null,null,1]
[null,"DESEO",null,null,null,null,null,1]
[null,"ESPERANZA",null,null,null,null,null,1]
[null,"ORGULLO",null,null,null,null,null,1]
[]
[]
[]
[null,"EMOCIONES \\ INTENSIDAD","NADA","POCO","MEDIANAMENTE","BASTANTE","MUCHO","VALORACIÓN"]
[null,null,1.00000000001,2,3,4,5]
[null,{"$f":"$B30","v":"ALEGRÍA"},null,null,null,null,null,{"$f":"IF((SUMIF(C47:G47,\"X\",$C$46:$G$46)),(SUMIF(C47:G47,\"X\",$C$46:$G$46)), 1)","v":1}]
[null,"SATISFACCIÓN",null,null,null,null,null,{"$f":"IF((SUMIF(C48:G48,\"X\",$C$46:$G$46)),(SUMIF(C48:G48,\"X\",$C$46:$G$46)), 1)","v":1}]
[null,"FASCINACIÓN",null,null,null,null,null,1]
[null,"ABURRIMIENTO",null,null,null,null,null,1]
[null,"ENFADO",null,null,null,null,null,1]
[null,"TRISTEZA",null,null,null,null,null,1]
[null,"VERGÜENZA",null,null,null,null,null,1]
[null,"MIEDO",null,null,null,null,null,1]
[null,"REPUGNANCIA",null,null,null,null,null,1]
[null,"DESEO",null,null,null,null,null,1]
[null,"ESPERANZA",null,null,null,null,null,1]
[null,"ORGULLO",null,null,null,null,null,1]
[]
[]
[]
[]
[null,"EMOCIONES \\ INTENSIDAD","NADA","POCO","MEDIANAMENTE","BASTANTE","MUCHO","VALORACIÓN"]
[null,null,1.00000000001,2,3,4,5]
[null,{"$f":"$B47","v":"ALEGRÍA"},null,null,null,null,null,{"$f":"IF((SUMIF(C65:G65,\"X\",$C$64:$G$64)),(SUMIF(C65:G65,\"X\",$C$64:$G$64)), 1)","v":1}]
[null,"SATISFACCIÓN",null,null,null,null,null,{"$f":"IF((SUMIF(C66:G66,\"X\",$C$64:$G$64)),(SUMIF(C66:G66,\"X\",$C$64:$G$64)), 1)","v":1}]
[null,"FASCINACIÓN",null,null,null,null,null,1]
[null,"ABURRIMIENTO",null,null,null,null,null,1]
[null,"ENFADO",null,null,null,null,null,1]
[null,"TRISTEZA",null,null,null,null,null,1]
[null,"VERGÜENZA",null,null,null,null,null,1]
[null,"MIEDO",null,null,null,null,null,1]
[null,"REPUGNANCIA",null,null,null,null,null,1]
[null,"DESEO",null,null,null,null,null,1]
[null,"ESPERANZA",null,null,null,null,null,1]
[null,"ORGULLO",null,null,null,null,null,1]
[]
[]
[]
[]
[null,"EMOCIONES \\ INTENSIDAD","NADA","POCO","MEDIANAMENTE","BASTANTE","MUCHO","VALORACIÓN"]
[null,null,1.00000000001,2,3,4,5]
[null,{"$f":"$B65","v":"ALEGRÍA"},null,null,null,null,null,{"$f":"IF((SUMIF(C83:G83,\"X\",$C$82:$G$82)),(SUMIF(C83:G83,\"X\",$C$82:$G$82)), 1)","v":1}]
[null,"SATISFACCIÓN",null,null,null,null,null,{"$f":"IF((SUMIF(C84:G84,\"X\",$C$82:$G$82)),(SUMIF(C84:G84,\"X\",$C$82:$G$82)), 1)","v":1}]
[null,"FASCINACIÓN",null,null,null,null,null,1]
[null,"ABURRIMIENTO",null,null,null,null,null,1]
[null,"ENFADO",null,null,null,null,null,1]
[null,"TRISTEZA",null,null,null,null,null,1]
[null,"VERGÜENZA",null,null,null,null,null,1]
[null,"MIEDO",null,null,null,null,null,1]
[null,"REPUGNANCIA",null,null,null,null,null,1]
[null,"DESEO",null,null,null,null,null,1]
[null,"ESPERANZA",null,null,null,null,null,1]
[null,"ORGULLO",null,null,null,null,null,1]
[]
[]
[]
[]
[null,"EMOCIONES \\ INTENSIDAD","NADA","POCO","MEDIANAMENTE","BASTANTE","MUCHO","VALORACIÓN"]
[null,null,1.00000000001,2,3,4,5]
[null,{"$f":"$B83","v":"ALEGRÍA"},null,null,null,null,null,{"$f":"IF((SUMIF(C101:G101,\"X\",$C$100:$G$100)),(SUMIF(C101:G101,\"X\",$C$100:$G$100)), 1)","v":1}]
[null,"SATISFACCIÓN",null,null,null,null,null,{"$f":"IF((SUMIF(C102:G102,\"X\",$C$100:$G$100)),(SUMIF(C102:G102,\"X\",$C$100:$G$100)), 1)","v":1}]
[null,"FASCINACIÓN",null,null,null,null,null,1]
[null,"ABURRIMIENTO",null,null,null,null,null,1]
[null,"ENFADO",null,null,null,null,null,1]
[null,"TRISTEZA",null,null,null,null,null,1]
[null,"VERGÜENZA",null,null,null,null,null,1]
[null,"MIEDO",null,null,null,null,null,1]
[null,"REPUGNANCIA",null,null,null,null,null,1]
[null,"DESEO",null,null,null,null,null,1]
[null,"ESPERANZA",null,null,null,null,null,1]
[null,"ORGULLO",null,null,null,null,null,1]

{"sheet":"User17","index":17,"n_rows":112,"n_cols":13,"rows_kept":112,"cut":false,"hidden":false,"merged":[[98,1,99,1],[98,7,99,7],[44,1,45,1],[44,7,45,7],[62,1,63,1],[62,7,63,7],[80,1,81,1],[80,7,81,7],[0,1,0,17],[2,13,5,17],[10,1,11,1],[10,7,11,7],[27,1,28,1],[27,7,28,7]]}
[null,"ESTAS TABLAS UTILIZAN MACROS DE EXCEL, POR LO TANTO CUANDO SE LE CONSULTE AL ABRIR EL ARCHIVO DEBE ACEPTAR Y HABILITAR LAS MACROS PARA QUE FUNCIONEN CORRECTAMENTE"]
[]
[null,"VALORACIÓN EMOCIONAL DE PRODUCTOS, MATERIALES O SERVICIOS",null,null,null,null,null,null,"GÉNERO:",null,"EDAD:",null,"OBS:"]
[]
[null,"DÍGANOS COMO SE SIENTE RESPECTO A CADA PRODUCTO, MATERIAL O SERVICIO"]
[null,"· ESCOJA ENTRE 3 Y 5 EMOCIONES QUE UD. EXPERIMENTE CON MAYOR INTENSIDAD"]
[null,"· MARQUE CON UNA X LAS EMOCIONES Y LOS NIVELES DE INTENSIDAD ESCOGIDOS"]
[null,"· MARQUE SUS PREFERENCIAS CON UN DOBLE CLIC EN LA CELDA ESCOGIDA (PUEDE BORRAR DEL MISMO MODO)"]
[]
[]
[null,"EMOCIONES \\ INTENSIDAD","NADA","POCO","MEDIANAMENTE","BASTANTE","MUCHO","VALORACIÓN"]
[null,null,1.00000000001,2,3,4,5]
[null,{"$f":"User01!B13","v":"ALEGRÍA"},null,null,null,null,null,{"$f":"IF((SUMIF(C13:G13,\"X\",$C$12:$G$12)),(SUMIF(C13:G13,\"X\",$C$12:$G$12)), 1)","v":1}]
[null,{"$f":"User01!B14","v":"SATISFACCIÓN"},null,null,null,null,null,{"$f":"IF((SUMIF(C14:G14,\"X\",$C$12:$G$12)),(SUMIF(C14:G14,\"X\",$C$12:$G$12)), 1)","v":1}]
[null,{"$f":"User01!B15","v":"FASCINACIÓN"},null,null,null,null,null,1]
[null,{"$f":"User01!B16","v":"ABURRIMIENTO"},null,null,null,null,null,1]
[null,{"$f":"User01!B17","v":"ENFADO"},null,null,null,null,null,1]
[null,{"$f":"User01!B18","v":"TRISTEZA"},null,null,null,null,null,1]
[null,{"$f":"User01!B19","v":"VERGÜENZA"},null,null,null,null,null,1]
[null,{"$f":"User01!B20","v":"MIEDO"},null,null,null,null,null,1]
[null,{"$f":"User01!B21","v":"REPUGNANCIA"},null,null,null,null,null,1]
[null,{"$f":"User01!B22","v":"DESEO"},null,null,null,null,null,1]
[null,{"$f":"User01!B23","v":"ESPERANZA"},null,null,null,null,null,1]
[null,{"$f":"User01!B24","v":"ORGULLO"},null,null,null,null,null,1]
[]
[]
[]
[null,"EMOCIONES \\ INTENSIDAD","NADA","POCO","MEDIANAMENTE","BASTANTE","MUCHO","VALORACIÓN"]
[null,null,1.00000000001,2,3,4,5]
[null,{"$f":"$B13","v":"ALEGRÍA"},null,null,null,null,null,{"$f":"IF((SUMIF(C30:G30,\"X\",$C$29:$G$29)),(SUMIF(C30:G30,\"X\",$C$29:$G$29)), 1)","v":1}]
[null,"SATISFACCIÓN",null,null,null,null,null,{"$f":"IF((SUMIF(C31:G31,\"X\",$C$29:$G$29)),(SUMIF(C31:G31,\"X\",$C$29:$G$29)), 1)","v":1}]
[null,"FASCINACIÓN",null,null,null,null,null,1]
[null,"ABURRIMIENTO",null,null,null,null,null,1]
[null,"ENFADO",null,null,null,null,null,1]
[null,"TRISTEZA",null,null,null,null,null,1]
[null,"VERGÜENZA",null,null,null,null,null,1]
[null,"MIEDO",null,null,null,null,null,1]
[null,"REPUGNANCIA",null,null,null,null,null,1]
[null,"DESEO",null,null,null,null,null,1]
[null,"ESPERANZA",null,null,null,null,null,1]
[null,"ORGULLO",null,null,null,null,null,1]
[]
[]
[]
[null,"EMOCIONES \\ INTENSIDAD","NADA","POCO","MEDIANAMENTE","BASTANTE","MUCHO","VALORACIÓN"]
[null,null,1.00000000001,2,3,4,5]
[null,{"$f":"$B30","v":"ALEGRÍA"},null,null,null,null,null,{"$f":"IF((SUMIF(C47:G47,\"X\",$C$46:$G$46)),(SUMIF(C47:G47,\"X\",$C$46:$G$46)), 1)","v":1}]
[null,"SATISFACCIÓN",null,null,null,null,null,{"$f":"IF((SUMIF(C48:G48,\"X\",$C$46:$G$46)),(SUMIF(C48:G48,\"X\",$C$46:$G$46)), 1)","v":1}]
[null,"FASCINACIÓN",null,null,null,null,null,1]
[null,"ABURRIMIENTO",null,null,null,null,null,1]
[null,"ENFADO",null,null,null,null,null,1]
[null,"TRISTEZA",null,null,null,null,null,1]
[null,"VERGÜENZA",null,null,null,null,null,1]
[null,"MIEDO",null,null,null,null,null,1]
[null,"REPUGNANCIA",null,null,null,null,null,1]
[null,"DESEO",null,null,null,null,null,1]
[null,"ESPERANZA",null,null,null,null,null,1]
[null,"ORGULLO",null,null,null,null,null,1]
[]
[]
[]
[]
[null,"EMOCIONES \\ INTENSIDAD","NADA","POCO","MEDIANAMENTE","BASTANTE","MUCHO","VALORACIÓN"]
[null,null,1.00000000001,2,3,4,5]
[null,{"$f":"$B47","v":"ALEGRÍA"},null,null,null,null,null,{"$f":"IF((SUMIF(C65:G65,\"X\",$C$64:$G$64)),(SUMIF(C65:G65,\"X\",$C$64:$G$64)), 1)","v":1}]
[null,"SATISFACCIÓN",null,null,null,null,null,{"$f":"IF((SUMIF(C66:G66,\"X\",$C$64:$G$64)),(SUMIF(C66:G66,\"X\",$C$64:$G$64)), 1)","v":1}]
[null,"FASCINACIÓN",null,null,null,null,null,1]
[null,"ABURRIMIENTO",null,null,null,null,null,1]
[null,"ENFADO",null,null,null,null,null,1]
[null,"TRISTEZA",null,null,null,null,null,1]
[null,"VERGÜENZA",null,null,null,null,null,1]
[null,"MIEDO",null,null,null,null,null,1]
[null,"REPUGNANCIA",null,null,null,null,null,1]
[null,"DESEO",null,null,null,null,null,1]
[null,"ESPERANZA",null,null,null,null,null,1]
[null,"ORGULLO",null,null,null,null,null,1]
[]
[]
[]
[]
[null,"EMOCIONES \\ INTENSIDAD","NADA","POCO","MEDIANAMENTE","BASTANTE","MUCHO","VALORACIÓN"]
[null,null,1.00000000001,2,3,4,5]
[null,{"$f":"$B65","v":"ALEGRÍA"},null,null,null,null,null,{"$f":"IF((SUMIF(C83:G83,\"X\",$C$82:$G$82)),(SUMIF(C83:G83,\"X\",$C$82:$G$82)), 1)","v":1}]
[null,"SATISFACCIÓN",null,null,null,null,null,{"$f":"IF((SUMIF(C84:G84,\"X\",$C$82:$G$82)),(SUMIF(C84:G84,\"X\",$C$82:$G$82)), 1)","v":1}]
[null,"FASCINACIÓN",null,null,null,null,null,1]
[null,"ABURRIMIENTO",null,null,null,null,null,1]
[null,"ENFADO",null,null,null,null,null,1]
[null,"TRISTEZA",null,null,null,null,null,1]
[null,"VERGÜENZA",null,null,null,null,null,1]
[null,"MIEDO",null,null,null,null,null,1]
[null,"REPUGNANCIA",null,null,null,null,null,1]
[null,"DESEO",null,null,null,null,null,1]
[null,"ESPERANZA",null,null,null,null,null,1]
[null,"ORGULLO",null,null,null,null,null,1]
[]
[]
[]
[]
[null,"EMOCIONES \\ INTENSIDAD","NADA","POCO","MEDIANAMENTE","BASTANTE","MUCHO","VALORACIÓN"]
[null,null,1.00000000001,2,3,4,5]
[null,{"$f":"$B83","v":"ALEGRÍA"},null,null,null,null,null,{"$f":"IF((SUMIF(C101:G101,\"X\",$C$100:$G$100)),(SUMIF(C101:G101,\"X\",$C$100:$G$100)), 1)","v":1}]
[null,"SATISFACCIÓN",null,null,null,null,null,{"$f":"IF((SUMIF(C102:G102,\"X\",$C$100:$G$100)),(SUMIF(C102:G102,\"X\",$C$100:$G$100)), 1)","v":1}]
[null,"FASCINACIÓN",null,null,null,null,null,1]
[null,"ABURRIMIENTO",null,null,null,null,null,1]
[null,"ENFADO",null,null,null,null,null,1]
[null,"TRISTEZA",null,null,null,null,null,1]
[null,"VERGÜENZA",null,null,null,null,null,1]
[null,"MIEDO",null,null,null,null,null,1]
[null,"REPUGNANCIA",null,null,null,null,null,1]
[null,"DESEO",null,null,null,null,null,1]
[null,"ESPERANZA",null,null,null,null,null,1]
[null,"ORGULLO",null,null,null,null,null,1]

{"sheet":"User18","index":18,"n_rows":112,"n_cols":13,"rows_kept":112,"cut":false,"hidden":false,"merged":[[98,1,99,1],[98,7,99,7],[44,1,45,1],[44,7,45,7],[62,1,63,1],[62,7,63,7],[80,1,81,1],[80,7,81,7],[0,1,0,17],[2,13,5,17],[10,1,11,1],[10,7,11,7],[27,1,28,1],[27,7,28,7]]}
[null,"ESTAS TABLAS UTILIZAN MACROS DE EXCEL, POR LO TANTO CUANDO SE LE CONSULTE AL ABRIR EL ARCHIVO DEBE ACEPTAR Y HABILITAR LAS MACROS PARA QUE FUNCIONEN CORRECTAMENTE"]
[]
[null,"VALORACIÓN EMOCIONAL DE PRODUCTOS, MATERIALES O SERVICIOS",null,null,null,null,null,null,"GÉNERO:",null,"EDAD:",null,"OBS:"]
[]
[null,"DÍGANOS COMO SE SIENTE RESPECTO A CADA PRODUCTO, MATERIAL O SERVICIO"]
[null,"· ESCOJA ENTRE 3 Y 5 EMOCIONES QUE UD. EXPERIMENTE CON MAYOR INTENSIDAD"]
[null,"· MARQUE CON UNA X LAS EMOCIONES Y LOS NIVELES DE INTENSIDAD ESCOGIDOS"]
[null,"· MARQUE SUS PREFERENCIAS CON UN DOBLE CLIC EN LA CELDA ESCOGIDA (PUEDE BORRAR DEL MISMO MODO)"]
[]
[]
[null,"EMOCIONES \\ INTENSIDAD","NADA","POCO","MEDIANAMENTE","BASTANTE","MUCHO","VALORACIÓN"]
[null,null,1.00000000001,2,3,4,5]
[null,{"$f":"User01!B13","v":"ALEGRÍA"},null,null,null,null,null,{"$f":"IF((SUMIF(C13:G13,\"X\",$C$12:$G$12)),(SUMIF(C13:G13,\"X\",$C$12:$G$12)), 1)","v":1}]
[null,{"$f":"User01!B14","v":"SATISFACCIÓN"},null,null,null,null,null,{"$f":"IF((SUMIF(C14:G14,\"X\",$C$12:$G$12)),(SUMIF(C14:G14,\"X\",$C$12:$G$12)), 1)","v":1}]
[null,{"$f":"User01!B15","v":"FASCINACIÓN"},null,null,null,null,null,1]
[null,{"$f":"User01!B16","v":"ABURRIMIENTO"},null,null,null,null,null,1]
[null,{"$f":"User01!B17","v":"ENFADO"},null,null,null,null,null,1]
[null,{"$f":"User01!B18","v":"TRISTEZA"},null,null,null,null,null,1]
[null,{"$f":"User01!B19","v":"VERGÜENZA"},null,null,null,null,null,1]
[null,{"$f":"User01!B20","v":"MIEDO"},null,null,null,null,null,1]
[null,{"$f":"User01!B21","v":"REPUGNANCIA"},null,null,null,null,null,1]
[null,{"$f":"User01!B22","v":"DESEO"},null,null,null,null,null,1]
[null,{"$f":"User01!B23","v":"ESPERANZA"},null,null,null,null,null,1]
[null,{"$f":"User01!B24","v":"ORGULLO"},null,null,null,null,null,1]
[]
[]
[]
[null,"EMOCIONES \\ INTENSIDAD","NADA","POCO","MEDIANAMENTE","BASTANTE","MUCHO","VALORACIÓN"]
[null,null,1.00000000001,2,3,4,5]
[null,{"$f":"$B13","v":"ALEGRÍA"},null,null,null,null,null,{"$f":"IF((SUMIF(C30:G30,\"X\",$C$29:$G$29)),(SUMIF(C30:G30,\"X\",$C$29:$G$29)), 1)","v":1}]
[null,"SATISFACCIÓN",null,null,null,null,null,{"$f":"IF((SUMIF(C31:G31,\"X\",$C$29:$G$29)),(SUMIF(C31:G31,\"X\",$C$29:$G$29)), 1)","v":1}]
[null,"FASCINACIÓN",null,null,null,null,null,1]
[null,"ABURRIMIENTO",null,null,null,null,null,1]
[null,"ENFADO",null,null,null,null,null,1]
[null,"TRISTEZA",null,null,null,null,null,1]
[null,"VERGÜENZA",null,null,null,null,null,1]
[null,"MIEDO",null,null,null,null,null,1]
[null,"REPUGNANCIA",null,null,null,null,null,1]
[null,"DESEO",null,null,null,null,null,1]
[null,"ESPERANZA",null,null,null,null,null,1]
[null,"ORGULLO",null,null,null,null,null,1]
[]
[]
[]
[null,"EMOCIONES \\ INTENSIDAD","NADA","POCO","MEDIANAMENTE","BASTANTE","MUCHO","VALORACIÓN"]
[null,null,1.00000000001,2,3,4,5]
[null,{"$f":"$B30","v":"ALEGRÍA"},null,null,null,null,null,{"$f":"IF((SUMIF(C47:G47,\"X\",$C$46:$G$46)),(SUMIF(C47:G47,\"X\",$C$46:$G$46)), 1)","v":1}]
[null,"SATISFACCIÓN",null,null,null,null,null,{"$f":"IF((SUMIF(C48:G48,\"X\",$C$46:$G$46)),(SUMIF(C48:G48,\"X\",$C$46:$G$46)), 1)","v":1}]
[null,"FASCINACIÓN",null,null,null,null,null,1]
[null,"ABURRIMIENTO",null,null,null,null,null,1]
[null,"ENFADO",null,null,null,null,null,1]
[null,"TRISTEZA",null,null,null,null,null,1]
[null,"VERGÜENZA",null,null,null,null,null,1]
[null,"MIEDO",null,null,null,null,null,1]
[null,"REPUGNANCIA",null,null,null,null,null,1]
[null,"DESEO",null,null,null,null,null,1]
[null,"ESPERANZA",null,null,null,null,null,1]
[null,"ORGULLO",null,null,null,null,null,1]
[]
[]
[]
[]
[null,"EMOCIONES \\ INTENSIDAD","NADA","POCO","MEDIANAMENTE","BASTANTE","MUCHO","VALORACIÓN"]
[null,null,1.00000000001,2,3,4,5]
[null,{"$f":"$B47","v":"ALEGRÍA"},null,null,null,null,null,{"$f":"IF((SUMIF(C65:G65,\"X\",$C$64:$G$64)),(SUMIF(C65:G65,\"X\",$C$64:$G$64)), 1)","v":1}]
[null,"SATISFACCIÓN",null,null,null,null,null,{"$f":"IF((SUMIF(C66:G66,\"X\",$C$64:$G$64)),(SUMIF(C66:G66,\"X\",$C$64:$G$64)), 1)","v":1}]
[null,"FASCINACIÓN",null,null,null,null,null,1]
[null,"ABURRIMIENTO",null,null,null,null,null,1]
[null,"ENFADO",null,null,null,null,null,1]
[null,"TRISTEZA",null,null,null,null,null,1]
[null,"VERGÜENZA",null,null,null,null,null,1]
[null,"MIEDO",null,null,null,null,null,1]
[null,"REPUGNANCIA",null,null,null,null,null,1]
[null,"DESEO",null,null,null,null,null,1]
[null,"ESPERANZA",null,null,null,null,null,1]
[null,"ORGULLO",null,null,null,null,null,1]
[]
[]
[]
[]
[null,"EMOCIONES \\ INTENSIDAD","NADA","POCO","MEDIANAMENTE","BASTANTE","MUCHO","VALORACIÓN"]
[null,null,1.00000000001,2,3,4,5]
[null,{"$f":"$B65","v":"ALEGRÍA"},null,null,null,null,null,{"$f":"IF((SUMIF(C83:G83,\"X\",$C$82:$G$82)),(SUMIF(C83:G83,\"X\",$C$82:$G$82)), 1)","v":1}]
[null,"SATISFACCIÓN",null,null,null,null,null,{"$f":"IF((SUMIF(C84:G84,\"X\",$C$82:$G$82)),(SUMIF(C84:G84,\"X\",$C$82:$G$82)), 1)","v":1}]
[null,"FASCINACIÓN",null,null,null,null,null,1]
[null,"ABURRIMIENTO",null,null,null,null,null,1]
[null,"ENFADO",null,null,null,null,null,1]
[null,"TRISTEZA",null,null,null,null,null,1]
[null,"VERGÜENZA",null,null,null,null,null,1]
[null,"MIEDO",null,null,null,null,null,1]
[null,"REPUGNANCIA",null,null,null,null,null,1]
[null,"DESEO",null,null,null,null,null,1]
[null,"ESPERANZA",null,null,null,null,null,1]
[null,"ORGULLO",null,null,null,null,null,1]
[]
[]
[]
[]
[null,"EMOCIONES \\ INTENSIDAD","NADA","POCO","MEDIANAMENTE","BASTANTE","MUCHO","VALORACIÓN"]
[null,null,1.00000000001,2,3,4,5]
[null,{"$f":"$B83","v":"ALEGRÍA"},null,null,null,null,null,{"$f":"IF((SUMIF(C101:G101,\"X\",$C$100:$G$100)),(SUMIF(C101:G101,\"X\",$C$100:$G$100)), 1)","v":1}]
[null,"SATISFACCIÓN",null,null,null,null,null,{"$f":"IF((SUMIF(C102:G102,\"X\",$C$100:$G$100)),(SUMIF(C102:G102,\"X\",$C$100:$G$100)), 1)","v":1}]
[null,"FASCINACIÓN",null,null,null,null,null,1]
[null,"ABURRIMIENTO",null,null,null,null,null,1]
[null,"ENFADO",null,null,null,null,null,1]
[null,"TRISTEZA",null,null,null,null,null,1]
[null,"VERGÜENZA",null,null,null,null,null,1]
[null,"MIEDO",null,null,null,null,null,1]
[null,"REPUGNANCIA",null,null,null,null,null,1]
[null,"DESEO",null,null,null,null,null,1]
[null,"ESPERANZA",null,null,null,null,null,1]
[null,"ORGULLO",null,null,null,null,null,1]

{"sheet":"User19","index":19,"n_rows":112,"n_cols":13,"rows_kept":112,"cut":false,"hidden":false,"merged":[[98,1,99,1],[98,7,99,7],[44,1,45,1],[44,7,45,7],[62,1,63,1],[62,7,63,7],[80,1,81,1],[80,7,81,7],[0,1,0,17],[2,13,5,17],[10,1,11,1],[10,7,11,7],[27,1,28,1],[27,7,28,7]]}
[null,"ESTAS TABLAS UTILIZAN MACROS DE EXCEL, POR LO TANTO CUANDO SE LE CONSULTE AL ABRIR EL ARCHIVO DEBE ACEPTAR Y HABILITAR LAS MACROS PARA QUE FUNCIONEN CORRECTAMENTE"]
[]
[null,"VALORACIÓN EMOCIONAL DE PRODUCTOS, MATERIALES O SERVICIOS",null,null,null,null,null,null,"GÉNERO:",null,"EDAD:",null,"OBS:"]
[]
[null,"DÍGANOS COMO SE SIENTE RESPECTO A CADA PRODUCTO, MATERIAL O SERVICIO"]
[null,"· ESCOJA ENTRE 3 Y 5 EMOCIONES QUE UD. EXPERIMENTE CON MAYOR INTENSIDAD"]
[null,"· MARQUE CON UNA X LAS EMOCIONES Y LOS NIVELES DE INTENSIDAD ESCOGIDOS"]
[null,"· MARQUE SUS PREFERENCIAS CON UN DOBLE CLIC EN LA CELDA ESCOGIDA (PUEDE BORRAR DEL MISMO MODO)"]
[]
[]
[null,"EMOCIONES \\ INTENSIDAD","NADA","POCO","MEDIANAMENTE","BASTANTE","MUCHO","VALORACIÓN"]
[null,null,1.00000000001,2,3,4,5]
[null,{"$f":"User01!B13","v":"ALEGRÍA"},null,null,null,null,null,{"$f":"IF((SUMIF(C13:G13,\"X\",$C$12:$G$12)),(SUMIF(C13:G13,\"X\",$C$12:$G$12)), 1)","v":1}]
[null,{"$f":"User01!B14","v":"SATISFACCIÓN"},null,null,null,null,null,{"$f":"IF((SUMIF(C14:G14,\"X\",$C$12:$G$12)),(SUMIF(C14:G14,\"X\",$C$12:$G$12)), 1)","v":1}]
[null,{"$f":"User01!B15","v":"FASCINACIÓN"},null,null,null,null,null,1]
[null,{"$f":"User01!B16","v":"ABURRIMIENTO"},null,null,null,null,null,1]
[null,{"$f":"User01!B17","v":"ENFADO"},null,null,null,null,null,1]
[null,{"$f":"User01!B18","v":"TRISTEZA"},null,null,null,null,null,1]
[null,{"$f":"User01!B19","v":"VERGÜENZA"},null,null,null,null,null,1]
[null,{"$f":"User01!B20","v":"MIEDO"},null,null,null,null,null,1]
[null,{"$f":"User01!B21","v":"REPUGNANCIA"},null,null,null,null,null,1]
[null,{"$f":"User01!B22","v":"DESEO"},null,null,null,null,null,1]
[null,{"$f":"User01!B23","v":"ESPERANZA"},null,null,null,null,null,1]
[null,{"$f":"User01!B24","v":"ORGULLO"},null,null,null,null,null,1]
[]
[]
[]
[null,"EMOCIONES \\ INTENSIDAD","NADA","POCO","MEDIANAMENTE","BASTANTE","MUCHO","VALORACIÓN"]
[null,null,1.00000000001,2,3,4,5]
[null,{"$f":"$B13","v":"ALEGRÍA"},null,null,null,null,null,{"$f":"IF((SUMIF(C30:G30,\"X\",$C$29:$G$29)),(SUMIF(C30:G30,\"X\",$C$29:$G$29)), 1)","v":1}]
[null,"SATISFACCIÓN",null,null,null,null,null,{"$f":"IF((SUMIF(C31:G31,\"X\",$C$29:$G$29)),(SUMIF(C31:G31,\"X\",$C$29:$G$29)), 1)","v":1}]
[null,"FASCINACIÓN",null,null,null,null,null,1]
[null,"ABURRIMIENTO",null,null,null,null,null,1]
[null,"ENFADO",null,null,null,null,null,1]
[null,"TRISTEZA",null,null,null,null,null,1]
[null,"VERGÜENZA",null,null,null,null,null,1]
[null,"MIEDO",null,null,null,null,null,1]
[null,"REPUGNANCIA",null,null,null,null,null,1]
[null,"DESEO",null,null,null,null,null,1]
[null,"ESPERANZA",null,null,null,null,null,1]
[null,"ORGULLO",null,null,null,null,null,1]
[]
[]
[]
[null,"EMOCIONES \\ INTENSIDAD","NADA","POCO","MEDIANAMENTE","BASTANTE","MUCHO","VALORACIÓN"]
[null,null,1.00000000001,2,3,4,5]
[null,{"$f":"$B30","v":"ALEGRÍA"},null,null,null,null,null,{"$f":"IF((SUMIF(C47:G47,\"X\",$C$46:$G$46)),(SUMIF(C47:G47,\"X\",$C$46:$G$46)), 1)","v":1}]
[null,"SATISFACCIÓN",null,null,null,null,null,{"$f":"IF((SUMIF(C48:G48,\"X\",$C$46:$G$46)),(SUMIF(C48:G48,\"X\",$C$46:$G$46)), 1)","v":1}]
[null,"FASCINACIÓN",null,null,null,null,null,1]
[null,"ABURRIMIENTO",null,null,null,null,null,1]
[null,"ENFADO",null,null,null,null,null,1]
[null,"TRISTEZA",null,null,null,null,null,1]
[null,"VERGÜENZA",null,null,null,null,null,1]
[null,"MIEDO",null,null,null,null,null,1]
[null,"REPUGNANCIA",null,null,null,null,null,1]
[null,"DESEO",null,null,null,null,null,1]
[null,"ESPERANZA",null,null,null,null,null,1]
[null,"ORGULLO",null,null,null,null,null,1]
[]
[]
[]
[]
[null,"EMOCIONES \\ INTENSIDAD","NADA","POCO","MEDIANAMENTE","BASTANTE","MUCHO","VALORACIÓN"]
[null,null,1.00000000001,2,3,4,5]
[null,{"$f":"$B47","v":"ALEGRÍA"},null,null,null,null,null,{"$f":"IF((SUMIF(C65:G65,\"X\",$C$64:$G$64)),(SUMIF(C65:G65,\"X\",$C$64:$G$64)), 1)","v":1}]
[null,"SATISFACCIÓN",null,null,null,null,null,{"$f":"IF((SUMIF(C66:G66,\"X\",$C$64:$G$64)),(SUMIF(C66:G66,\"X\",$C$64:$G$64)), 1)","v":1}]
[null,"FASCINACIÓN",null,null,null,null,null,1]
[null,"ABURRIMIENTO",null,null,null,null,null,1]
[null,"ENFADO",null,null,null,null,null,1]
[null,"TRISTEZA",null,null,null,null,null,1]
[null,"VERGÜENZA",null,null,null,null,null,1]
[null,"MIEDO",null,null,null,null,null,1]
[null,"REPUGNANCIA",null,null,null,null,null,1]
[null,"DESEO",null,null,null,null,null,1]
[null,"ESPERANZA",null,null,null,null,null,1]
[null,"ORGULLO",null,null,null,null,null,1]
[]
[]
[]
[]
[null,"EMOCIONES \\ INTENSIDAD","NADA","POCO","MEDIANAMENTE","BASTANTE","MUCHO","VALORACIÓN"]
[null,null,1.00000000001,2,3,4,5]
[null,{"$f":"$B65","v":"ALEGRÍA"},null,null,null,null,null,{"$f":"IF((SUMIF(C83:G83,\"X\",$C$82:$G$82)),(SUMIF(C83:G83,\"X\",$C$82:$G$82)), 1)","v":1}]
[null,"SATISFACCIÓN",null,null,null,null,null,{"$f":"IF((SUMIF(C84:G84,\"X\",$C$82:$G$82)),(SUMIF(C84:G84,\"X\",$C$82:$G$82)), 1)","v":1}]
[null,"FASCINACIÓN",null,null,null,null,null,1]
[null,"ABURRIMIENTO",null,null,null,null,null,1]
[null,"ENFADO",null,null,null,null,null,1]
[null,"TRISTEZA",null,null,null,null,null,1]
[null,"VERGÜENZA",null,null,null,null,null,1]
[null,"MIEDO",null,null,null,null,null,1]
[null,"REPUGNANCIA",null,null,null,null,null,1]
[null,"DESEO",null,null,null,null,null,1]
[null,"ESPERANZA",null,null,null,null,null,1]
[null,"ORGULLO",null,null,null,null,null,1]
[]
[]
[]
[]
[null,"EMOCIONES \\ INTENSIDAD","NADA","POCO","MEDIANAMENTE","BASTANTE","MUCHO","VALORACIÓN"]
[null,null,1.00000000001,2,3,4,5]
[null,{"$f":"$B83","v":"ALEGRÍA"},null,null,null,null,null,{"$f":"IF((SUMIF(C101:G101,\"X\",$C$100:$G$100)),(SUMIF(C101:G101,\"X\",$C$100:$G$100)), 1)","v":1}]
[null,"SATISFACCIÓN",null,null,null,null,null,{"$f":"IF((SUMIF(C102:G102,\"X\",$C$100:$G$100)),(SUMIF(C102:G102,\"X\",$C$100:$G$100)), 1)","v":1}]
[null,"FASCINACIÓN",null,null,null,null,null,1]
[null,"ABURRIMIENTO",null,null,null,null,null,1]
[null,"ENFADO",null,null,null,null,null,1]
[null,"TRISTEZA",null,null,null,null,null,1]
[null,"VERGÜENZA",null,null,null,null,null,1]
[null,"MIEDO",null,null,null,null,null,1]
[null,"REPUGNANCIA",null,null,null,null,null,1]
[null,"DESEO",null,null,null,null,null,1]
[null,"ESPERANZA",null,null,null,null,null,1]
[null,"ORGULLO",null,null,null,null,null,1]

{"sheet":"User20","index":20,"n_rows":112,"n_cols":13,"rows_kept":112,"cut":false,"hidden":false,"merged":[[98,1,99,1],[98,7,99,7],[44,1,45,1],[44,7,45,7],[62,1,63,1],[62,7,63,7],[80,1,81,1],[80,7,81,7],[0,1,0,17],[2,13,5,17],[10,1,11,1],[10,7,11,7],[27,1,28,1],[27,7,28,7]]}
[null,"ESTAS TABLAS UTILIZAN MACROS DE EXCEL, POR LO TANTO CUANDO SE LE CONSULTE AL ABRIR EL ARCHIVO DEBE ACEPTAR Y HABILITAR LAS MACROS PARA QUE FUNCIONEN CORRECTAMENTE"]
[]
[null,"VALORACIÓN EMOCIONAL DE PRODUCTOS, MATERIALES O SERVICIOS",null,null,null,null,null,null,"GÉNERO:",null,"EDAD:",null,"OBS:"]
[]
[null,"DÍGANOS COMO SE SIENTE RESPECTO A CADA PRODUCTO, MATERIAL O SERVICIO"]
[null,"· ESCOJA ENTRE 3 Y 5 EMOCIONES QUE UD. EXPERIMENTE CON MAYOR INTENSIDAD"]
[null,"· MARQUE CON UNA X LAS EMOCIONES Y LOS NIVELES DE INTENSIDAD ESCOGIDOS"]
[null,"· MARQUE SUS PREFERENCIAS CON UN DOBLE CLIC EN LA CELDA ESCOGIDA (PUEDE BORRAR DEL MISMO MODO)"]
[]
[]
[null,"EMOCIONES \\ INTENSIDAD","NADA","POCO","MEDIANAMENTE","BASTANTE","MUCHO","VALORACIÓN"]
[null,null,1.00000000001,2,3,4,5]
[null,{"$f":"User01!B13","v":"ALEGRÍA"},null,null,null,null,null,{"$f":"IF((SUMIF(C13:G13,\"X\",$C$12:$G$12)),(SUMIF(C13:G13,\"X\",$C$12:$G$12)), 1)","v":1}]
[null,{"$f":"User01!B14","v":"SATISFACCIÓN"},null,null,null,null,null,{"$f":"IF((SUMIF(C14:G14,\"X\",$C$12:$G$12)),(SUMIF(C14:G14,\"X\",$C$12:$G$12)), 1)","v":1}]
[null,{"$f":"User01!B15","v":"FASCINACIÓN"},null,null,null,null,null,1]
[null,{"$f":"User01!B16","v":"ABURRIMIENTO"},null,null,null,null,null,1]
[null,{"$f":"User01!B17","v":"ENFADO"},null,null,null,null,null,1]
[null,{"$f":"User01!B18","v":"TRISTEZA"},null,null,null,null,null,1]
[null,{"$f":"User01!B19","v":"VERGÜENZA"},null,null,null,null,null,1]
[null,{"$f":"User01!B20","v":"MIEDO"},null,null,null,null,null,1]
[null,{"$f":"User01!B21","v":"REPUGNANCIA"},null,null,null,null,null,1]
[null,{"$f":"User01!B22","v":"DESEO"},null,null,null,null,null,1]
[null,{"$f":"User01!B23","v":"ESPERANZA"},null,null,null,null,null,1]
[null,{"$f":"User01!B24","v":"ORGULLO"},null,null,null,null,null,1]
[]
[]
[]
[null,"EMOCIONES \\ INTENSIDAD","NADA","POCO","MEDIANAMENTE","BASTANTE","MUCHO","VALORACIÓN"]
[null,null,1.00000000001,2,3,4,5]
[null,{"$f":"$B13","v":"ALEGRÍA"},null,null,null,null,null,{"$f":"IF((SUMIF(C30:G30,\"X\",$C$29:$G$29)),(SUMIF(C30:G30,\"X\",$C$29:$G$29)), 1)","v":1}]
[null,"SATISFACCIÓN",null,null,null,null,null,{"$f":"IF((SUMIF(C31:G31,\"X\",$C$29:$G$29)),(SUMIF(C31:G31,\"X\",$C$29:$G$29)), 1)","v":1}]
[null,"FASCINACIÓN",null,null,null,null,null,1]
[null,"ABURRIMIENTO",null,null,null,null,null,1]
[null,"ENFADO",null,null,null,null,null,1]
[null,"TRISTEZA",null,null,null,null,null,1]
[null,"VERGÜENZA",null,null,null,null,null,1]
[null,"MIEDO",null,null,null,null,null,1]
[null,"REPUGNANCIA",null,null,null,null,null,1]
[null,"DESEO",null,null,null,null,null,1]
[null,"ESPERANZA",null,null,null,null,null,1]
[null,"ORGULLO",null,null,null,null,null,1]
[]
[]
[]
[null,"EMOCIONES \\ INTENSIDAD","NADA","POCO","MEDIANAMENTE","BASTANTE","MUCHO","VALORACIÓN"]
[null,null,1.00000000001,2,3,4,5]
[null,{"$f":"$B30","v":"ALEGRÍA"},null,null,null,null,null,{"$f":"IF((SUMIF(C47:G47,\"X\",$C$46:$G$46)),(SUMIF(C47:G47,\"X\",$C$46:$G$46)), 1)","v":1}]
[null,"SATISFACCIÓN",null,null,null,null,null,{"$f":"IF((SUMIF(C48:G48,\"X\",$C$46:$G$46)),(SUMIF(C48:G48,\"X\",$C$46:$G$46)), 1)","v":1}]
[null,"FASCINACIÓN",null,null,null,null,null,1]
[null,"ABURRIMIENTO",null,null,null,null,null,1]
[null,"ENFADO",null,null,null,null,null,1]
[null,"TRISTEZA",null,null,null,null,null,1]
[null,"VERGÜENZA",null,null,null,null,null,1]
[null,"MIEDO",null,null,null,null,null,1]
[null,"REPUGNANCIA",null,null,null,null,null,1]
[null,"DESEO",null,null,null,null,null,1]
[null,"ESPERANZA",null,null,null,null,null,1]
[null,"ORGULLO",null,null,null,null,null,1]
[]
[]
[]
[]
[null,"EMOCIONES \\ INTENSIDAD","NADA","POCO","MEDIANAMENTE","BASTANTE","MUCHO","VALORACIÓN"]
[null,null,1.00000000001,2,3,4,5]
[null,{"$f":"$B47","v":"ALEGRÍA"},null,null,null,null,null,{"$f":"IF((SUMIF(C65:G65,\"X\",$C$64:$G$64)),(SUMIF(C65:G65,\"X\",$C$64:$G$64)), 1)","v":1}]
[null,"SATISFACCIÓN",null,null,null,null,null,{"$f":"IF((SUMIF(C66:G66,\"X\",$C$64:$G$64)),(SUMIF(C66:G66,\"X\",$C$64:$G$64)), 1)","v":1}]
[null,"FASCINACIÓN",null,null,null,null,null,1]
[null,"ABURRIMIENTO",null,null,null,null,null,1]
[null,"ENFADO",null,null,null,null,null,1]
[null,"TRISTEZA",null,null,null,null,null,1]
[null,"VERGÜENZA",null,null,null,null,null,1]
[null,"MIEDO",null,null,null,null,null,1]
[null,"REPUGNANCIA",null,null,null,null,null,1]
[null,"DESEO",null,null,null,null,null,1]
[null,"ESPERANZA",null,null,null,null,null,1]
[null,"ORGULLO",null,null,null,null,null,1]
[]
[]
[]
[]
[null,"EMOCIONES \\ INTENSIDAD","NADA","POCO","MEDIANAMENTE","BASTANTE","MUCHO","VALORACIÓN"]
[null,null,1.00000000001,2,3,4,5]
[null,{"$f":"$B65","v":"ALEGRÍA"},null,null,null,null,null,{"$f":"IF((SUMIF(C83:G83,\"X\",$C$82:$G$82)),(SUMIF(C83:G83,\"X\",$C$82:$G$82)), 1)","v":1}]
[null,"SATISFACCIÓN",null,null,null,null,null,{"$f":"IF((SUMIF(C84:G84,\"X\",$C$82:$G$82)),(SUMIF(C84:G84,\"X\",$C$82:$G$82)), 1)","v":1}]
[null,"FASCINACIÓN",null,null,null,null,null,1]
[null,"ABURRIMIENTO",null,null,null,null,null,1]
[null,"ENFADO",null,null,null,null,null,1]
[null,"TRISTEZA",null,null,null,null,null,1]
[null,"VERGÜENZA",null,null,null,null,null,1]
[null,"MIEDO",null,null,null,null,null,1]
[null,"REPUGNANCIA",null,null,null,null,null,1]
[null,"DESEO",null,null,null,null,null,1]
[null,"ESPERANZA",null,null,null,null,null,1]
[null,"ORGULLO",null,null,null,null,null,1]
[]
[]
[]
[]
[null,"EMOCIONES \\ INTENSIDAD","NADA","POCO","MEDIANAMENTE","BASTANTE","MUCHO","VALORACIÓN"]
[null,null,1.00000000001,2,3,4,5]
[null,{"$f":"$B83","v":"ALEGRÍA"},null,null,null,null,null,{"$f":"IF((SUMIF(C101:G101,\"X\",$C$100:$G$100)),(SUMIF(C101:G101,\"X\",$C$100:$G$100)), 1)","v":1}]
[null,"SATISFACCIÓN",null,null,null,null,null,{"$f":"IF((SUMIF(C102:G102,\"X\",$C$100:$G$100)),(SUMIF(C102:G102,\"X\",$C$100:$G$100)), 1)","v":1}]
[null,"FASCINACIÓN",null,null,null,null,null,1]
[null,"ABURRIMIENTO",null,null,null,null,null,1]
[null,"ENFADO",null,null,null,null,null,1]
[null,"TRISTEZA",null,null,null,null,null,1]
[null,"VERGÜENZA",null,null,null,null,null,1]
[null,"MIEDO",null,null,null,null,null,1]
[null,"REPUGNANCIA",null,null,null,null,null,1]
[null,"DESEO",null,null,null,null,null,1]
[null,"ESPERANZA",null,null,null,null,null,1]
[null,"ORGULLO",null,null,null,null,null,1]

{"sheet":"User21","index":21,"n_rows":112,"n_cols":13,"rows_kept":112,"cut":false,"hidden":false,"merged":[[98,1,99,1],[98,7,99,7],[44,1,45,1],[44,7,45,7],[62,1,63,1],[62,7,63,7],[80,1,81,1],[80,7,81,7],[0,1,0,17],[2,13,5,17],[10,1,11,1],[10,7,11,7],[27,1,28,1],[27,7,28,7]]}
[null,"ESTAS TABLAS UTILIZAN MACROS DE EXCEL, POR LO TANTO CUANDO SE LE CONSULTE AL ABRIR EL ARCHIVO DEBE ACEPTAR Y HABILITAR LAS MACROS PARA QUE FUNCIONEN CORRECTAMENTE"]
[]
[null,"VALORACIÓN EMOCIONAL DE PRODUCTOS, MATERIALES O SERVICIOS",null,null,null,null,null,null,"GÉNERO:",null,"EDAD:",null,"OBS:"]
[]
[null,"DÍGANOS COMO SE SIENTE RESPECTO A CADA PRODUCTO, MATERIAL O SERVICIO"]
[null,"· ESCOJA ENTRE 3 Y 5 EMOCIONES QUE UD. EXPERIMENTE CON MAYOR INTENSIDAD"]
[null,"· MARQUE CON UNA X LAS EMOCIONES Y LOS NIVELES DE INTENSIDAD ESCOGIDOS"]
[null,"· MARQUE SUS PREFERENCIAS CON UN DOBLE CLIC EN LA CELDA ESCOGIDA (PUEDE BORRAR DEL MISMO MODO)"]
[]
[]
[null,"EMOCIONES \\ INTENSIDAD","NADA","POCO","MEDIANAMENTE","BASTANTE","MUCHO","VALORACIÓN"]
[null,null,1.00000000001,2,3,4,5]
[null,{"$f":"User01!B13","v":"ALEGRÍA"},null,null,null,null,null,{"$f":"IF((SUMIF(C13:G13,\"X\",$C$12:$G$12)),(SUMIF(C13:G13,\"X\",$C$12:$G$12)), 1)","v":1}]
[null,{"$f":"User01!B14","v":"SATISFACCIÓN"},null,null,null,null,null,{"$f":"IF((SUMIF(C14:G14,\"X\",$C$12:$G$12)),(SUMIF(C14:G14,\"X\",$C$12:$G$12)), 1)","v":1}]
[null,{"$f":"User01!B15","v":"FASCINACIÓN"},null,null,null,null,null,1]
[null,{"$f":"User01!B16","v":"ABURRIMIENTO"},null,null,null,null,null,1]
[null,{"$f":"User01!B17","v":"ENFADO"},null,null,null,null,null,1]
[null,{"$f":"User01!B18","v":"TRISTEZA"},null,null,null,null,null,1]
[null,{"$f":"User01!B19","v":"VERGÜENZA"},null,null,null,null,null,1]
[null,{"$f":"User01!B20","v":"MIEDO"},null,null,null,null,null,1]
[null,{"$f":"User01!B21","v":"REPUGNANCIA"},null,null,null,null,null,1]
[null,{"$f":"User01!B22","v":"DESEO"},null,null,null,null,null,1]
[null,{"$f":"User01!B23","v":"ESPERANZA"},null,null,null,null,null,1]
[null,{"$f":"User01!B24","v":"ORGULLO"},null,null,null,null,null,1]
[]
[]
[]
[null,"EMOCIONES \\ INTENSIDAD","NADA","POCO","MEDIANAMENTE","BASTANTE","MUCHO","VALORACIÓN"]
[null,null,1.00000000001,2,3,4,5]
[null,{"$f":"$B13","v":"ALEGRÍA"},null,null,null,null,null,{"$f":"IF((SUMIF(C30:G30,\"X\",$C$29:$G$29)),(SUMIF(C30:G30,\"X\",$C$29:$G$29)), 1)","v":1}]
[null,"SATISFACCIÓN",null,null,null,null,null,{"$f":"IF((SUMIF(C31:G31,\"X\",$C$29:$G$29)),(SUMIF(C31:G31,\"X\",$C$29:$G$29)), 1)","v":1}]
[null,"FASCINACIÓN",null,null,null,null,null,1]
[null,"ABURRIMIENTO",null,null,null,null,null,1]
[null,"ENFADO",null,null,null,null,null,1]
[null,"TRISTEZA",null,null,null,null,null,1]
[null,"VERGÜENZA",null,null,null,null,null,1]
[null,"MIEDO",null,null,null,null,null,1]
[null,"REPUGNANCIA",null,null,null,null,null,1]
[null,"DESEO",null,null,null,null,null,1]
[null,"ESPERANZA",null,null,null,null,null,1]
[null,"ORGULLO",null,null,null,null,null,1]
[]
[]
[]
[null,"EMOCIONES \\ INTENSIDAD","NADA","POCO","MEDIANAMENTE","BASTANTE","MUCHO","VALORACIÓN"]
[null,null,1.00000000001,2,3,4,5]
[null,{"$f":"$B30","v":"ALEGRÍA"},null,null,null,null,null,{"$f":"IF((SUMIF(C47:G47,\"X\",$C$46:$G$46)),(SUMIF(C47:G47,\"X\",$C$46:$G$46)), 1)","v":1}]
[null,"SATISFACCIÓN",null,null,null,null,null,{"$f":"IF((SUMIF(C48:G48,\"X\",$C$46:$G$46)),(SUMIF(C48:G48,\"X\",$C$46:$G$46)), 1)","v":1}]
[null,"FASCINACIÓN",null,null,null,null,null,1]
[null,"ABURRIMIENTO",null,null,null,null,null,1]
[null,"ENFADO",null,null,null,null,null,1]
[null,"TRISTEZA",null,null,null,null,null,1]
[null,"VERGÜENZA",null,null,null,null,null,1]
[null,"MIEDO",null,null,null,null,null,1]
[null,"REPUGNANCIA",null,null,null,null,null,1]
[null,"DESEO",null,null,null,null,null,1]
[null,"ESPERANZA",null,null,null,null,null,1]
[null,"ORGULLO",null,null,null,null,null,1]
[]
[]
[]
[]
[null,"EMOCIONES \\ INTENSIDAD","NADA","POCO","MEDIANAMENTE","BASTANTE","MUCHO","VALORACIÓN"]
[null,null,1.00000000001,2,3,4,5]
[null,{"$f":"$B47","v":"ALEGRÍA"},null,null,null,null,null,{"$f":"IF((SUMIF(C65:G65,\"X\",$C$64:$G$64)),(SUMIF(C65:G65,\"X\",$C$64:$G$64)), 1)","v":1}]
[null,"SATISFACCIÓN",null,null,null,null,null,{"$f":"IF((SUMIF(C66:G66,\"X\",$C$64:$G$64)),(SUMIF(C66:G66,\"X\",$C$64:$G$64)), 1)","v":1}]
[null,"FASCINACIÓN",null,null,null,null,null,1]
[null,"ABURRIMIENTO",null,null,null,null,null,1]
[null,"ENFADO",null,null,null,null,null,1]
[null,"TRISTEZA",null,null,null,null,null,1]
[null,"VERGÜENZA",null,null,null,null,null,1]
[null,"MIEDO",null,null,null,null,null,1]
[null,"REPUGNANCIA",null,null,null,null,null,1]
[null,"DESEO",null,null,null,null,null,1]
[null,"ESPERANZA",null,null,null,null,null,1]
[null,"ORGULLO",null,null,null,null,null,1]
[]
[]
[]
[]
[null,"EMOCIONES \\ INTENSIDAD","NADA","POCO","MEDIANAMENTE","BASTANTE","MUCHO","VALORACIÓN"]
[null,null,1.00000000001,2,3,4,5]
[null,{"$f":"$B65","v":"ALEGRÍA"},null,null,null,null,null,{"$f":"IF((SUMIF(C83:G83,\"X\",$C$82:$G$82)),(SUMIF(C83:G83,\"X\",$C$82:$G$82)), 1)","v":1}]
[null,"SATISFACCIÓN",null,null,null,null,null,{"$f":"IF((SUMIF(C84:G84,\"X\",$C$82:$G$82)),(SUMIF(C84:G84,\"X\",$C$82:$G$82)), 1)","v":1}]
[null,"FASCINACIÓN",null,null,null,null,null,1]
[null,"ABURRIMIENTO",null,null,null,null,null,1]
[null,"ENFADO",null,null,null,null,null,1]
[null,"TRISTEZA",null,null,null,null,null,1]
[null,"VERGÜENZA",null,null,null,null,null,1]
[null,"MIEDO",null,null,null,null,null,1]
[null,"REPUGNANCIA",null,null,null,null,null,1]
[null,"DESEO",null,null,null,null,null,1]
[null,"ESPERANZA",null,null,null,null,null,1]
[null,"ORGULLO",null,null,null,null,null,1]
[]
[]
[]
[]
[null,"EMOCIONES \\ INTENSIDAD","NADA","POCO","MEDIANAMENTE","BASTANTE","MUCHO","VALORACIÓN"]
[null,null,1.00000000001,2,3,4,5]
[null,{"$f":"$B83","v":"ALEGRÍA"},null,null,null,null,null,{"$f":"IF((SUMIF(C101:G101,\"X\",$C$100:$G$100)),(SUMIF(C101:G101,\"X\",$C$100:$G$100)), 1)","v":1}]
[null,"SATISFACCIÓN",null,null,null,null,null,{"$f":"IF((SUMIF(C102:G102,\"X\",$C$100:$G$100)),(SUMIF(C102:G102,\"X\",$C$100:$G$100)), 1)","v":1}]
[null,"FASCINACIÓN",null,null,null,null,null,1]
[null,"ABURRIMIENTO",null,null,null,null,null,1]
[null,"ENFADO",null,null,null,null,null,1]
[null,"TRISTEZA",null,null,null,null,null,1]
[null,"VERGÜENZA",null,null,null,null,null,1]
[null,"MIEDO",null,null,null,null,null,1]
[null,"REPUGNANCIA",null,null,null,null,null,1]
[null,"DESEO",null,null,null,null,null,1]
[null,"ESPERANZA",null,null,null,null,null,1]
[null,"ORGULLO",null,null,null,null,null,1]

{"sheet":"User22","index":22,"n_rows":112,"n_cols":13,"rows_kept":112,"cut":false,"hidden":false,"merged":[[98,1,99,1],[98,7,99,7],[44,1,45,1],[44,7,45,7],[62,1,63,1],[62,7,63,7],[80,1,81,1],[80,7,81,7],[0,1,0,17],[2,13,5,17],[10,1,11,1],[10,7,11,7],[27,1,28,1],[27,7,28,7]]}
[null,"ESTAS TABLAS UTILIZAN MACROS DE EXCEL, POR LO TANTO CUANDO SE LE CONSULTE AL ABRIR EL ARCHIVO DEBE ACEPTAR Y HABILITAR LAS MACROS PARA QUE FUNCIONEN CORRECTAMENTE"]
[]
[null,"VALORACIÓN EMOCIONAL DE PRODUCTOS, MATERIALES O SERVICIOS",null,null,null,null,null,null,"GÉNERO:",null,"EDAD:",null,"OBS:"]
[]
[null,"DÍGANOS COMO SE SIENTE RESPECTO A CADA PRODUCTO, MATERIAL O SERVICIO"]
[null,"· ESCOJA ENTRE 3 Y 5 EMOCIONES QUE UD. EXPERIMENTE CON MAYOR INTENSIDAD"]
[null,"· MARQUE CON UNA X LAS EMOCIONES Y LOS NIVELES DE INTENSIDAD ESCOGIDOS"]
[null,"· MARQUE SUS PREFERENCIAS CON UN DOBLE CLIC EN LA CELDA ESCOGIDA (PUEDE BORRAR DEL MISMO MODO)"]
[]
[]
[null,"EMOCIONES \\ INTENSIDAD","NADA","POCO","MEDIANAMENTE","BASTANTE","MUCHO","VALORACIÓN"]
[null,null,1.00000000001,2,3,4,5]
[null,{"$f":"User01!B13","v":"ALEGRÍA"},null,null,null,null,null,{"$f":"IF((SUMIF(C13:G13,\"X\",$C$12:$G$12)),(SUMIF(C13:G13,\"X\",$C$12:$G$12)), 1)","v":1}]
[null,{"$f":"User01!B14","v":"SATISFACCIÓN"},null,null,null,null,null,{"$f":"IF((SUMIF(C14:G14,\"X\",$C$12:$G$12)),(SUMIF(C14:G14,\"X\",$C$12:$G$12)), 1)","v":1}]
[null,{"$f":"User01!B15","v":"FASCINACIÓN"},null,null,null,null,null,1]
[null,{"$f":"User01!B16","v":"ABURRIMIENTO"},null,null,null,null,null,1]
[null,{"$f":"User01!B17","v":"ENFADO"},null,null,null,null,null,1]
[null,{"$f":"User01!B18","v":"TRISTEZA"},null,null,null,null,null,1]
[null,{"$f":"User01!B19","v":"VERGÜENZA"},null,null,null,null,null,1]
[null,{"$f":"User01!B20","v":"MIEDO"},null,null,null,null,null,1]
[null,{"$f":"User01!B21","v":"REPUGNANCIA"},null,null,null,null,null,1]
[null,{"$f":"User01!B22","v":"DESEO"},null,null,null,null,null,1]
[null,{"$f":"User01!B23","v":"ESPERANZA"},null,null,null,null,null,1]
[null,{"$f":"User01!B24","v":"ORGULLO"},null,null,null,null,null,1]
[]
[]
[]
[null,"EMOCIONES \\ INTENSIDAD","NADA","POCO","MEDIANAMENTE","BASTANTE","MUCHO","VALORACIÓN"]
[null,null,1.00000000001,2,3,4,5]
[null,{"$f":"$B13","v":"ALEGRÍA"},null,null,null,null,null,{"$f":"IF((SUMIF(C30:G30,\"X\",$C$29:$G$29)),(SUMIF(C30:G30,\"X\",$C$29:$G$29)), 1)","v":1}]
[null,"SATISFACCIÓN",null,null,null,null,null,{"$f":"IF((SUMIF(C31:G31,\"X\",$C$29:$G$29)),(SUMIF(C31:G31,\"X\",$C$29:$G$29)), 1)","v":1}]
[null,"FASCINACIÓN",null,null,null,null,null,1]
[null,"ABURRIMIENTO",null,null,null,null,null,1]
[null,"ENFADO",null,null,null,null,null,1]
[null,"TRISTEZA",null,null,null,null,null,1]
[null,"VERGÜENZA",null,null,null,null,null,1]
[null,"MIEDO",null,null,null,null,null,1]
[null,"REPUGNANCIA",null,null,null,null,null,1]
[null,"DESEO",null,null,null,null,null,1]
[null,"ESPERANZA",null,null,null,null,null,1]
[null,"ORGULLO",null,null,null,null,null,1]
[]
[]
[]
[null,"EMOCIONES \\ INTENSIDAD","NADA","POCO","MEDIANAMENTE","BASTANTE","MUCHO","VALORACIÓN"]
[null,null,1.00000000001,2,3,4,5]
[null,{"$f":"$B30","v":"ALEGRÍA"},null,null,null,null,null,{"$f":"IF((SUMIF(C47:G47,\"X\",$C$46:$G$46)),(SUMIF(C47:G47,\"X\",$C$46:$G$46)), 1)","v":1}]
[null,"SATISFACCIÓN",null,null,null,null,null,{"$f":"IF((SUMIF(C48:G48,\"X\",$C$46:$G$46)),(SUMIF(C48:G48,\"X\",$C$46:$G$46)), 1)","v":1}]
[null,"FASCINACIÓN",null,null,null,null,null,1]
[null,"ABURRIMIENTO",null,null,null,null,null,1]
[null,"ENFADO",null,null,null,null,null,1]
[null,"TRISTEZA",null,null,null,null,null,1]
[null,"VERGÜENZA",null,null,null,null,null,1]
[null,"MIEDO",null,null,null,null,null,1]
[null,"REPUGNANCIA",null,null,null,null,null,1]
[null,"DESEO",null,null,null,null,null,1]
[null,"ESPERANZA",null,null,null,null,null,1]
[null,"ORGULLO",null,null,null,null,null,1]
[]
[]
[]
[]
[null,"EMOCIONES \\ INTENSIDAD","NADA","POCO","MEDIANAMENTE","BASTANTE","MUCHO","VALORACIÓN"]
[null,null,1.00000000001,2,3,4,5]
[null,{"$f":"$B47","v":"ALEGRÍA"},null,null,null,null,null,{"$f":"IF((SUMIF(C65:G65,\"X\",$C$64:$G$64)),(SUMIF(C65:G65,\"X\",$C$64:$G$64)), 1)","v":1}]
[null,"SATISFACCIÓN",null,null,null,null,null,{"$f":"IF((SUMIF(C66:G66,\"X\",$C$64:$G$64)),(SUMIF(C66:G66,\"X\",$C$64:$G$64)), 1)","v":1}]
[null,"FASCINACIÓN",null,null,null,null,null,1]
[null,"ABURRIMIENTO",null,null,null,null,null,1]
[null,"ENFADO",null,null,null,null,null,1]
[null,"TRISTEZA",null,null,null,null,null,1]
[null,"VERGÜENZA",null,null,null,null,null,1]
[null,"MIEDO",null,null,null,null,null,1]
[null,"REPUGNANCIA",null,null,null,null,null,1]
[null,"DESEO",null,null,null,null,null,1]
[null,"ESPERANZA",null,null,null,null,null,1]
[null,"ORGULLO",null,null,null,null,null,1]
[]
[]
[]
[]
[null,"EMOCIONES \\ INTENSIDAD","NADA","POCO","MEDIANAMENTE","BASTANTE","MUCHO","VALORACIÓN"]
[null,null,1.00000000001,2,3,4,5]
[null,{"$f":"$B65","v":"ALEGRÍA"},null,null,null,null,null,{"$f":"IF((SUMIF(C83:G83,\"X\",$C$82:$G$82)),(SUMIF(C83:G83,\"X\",$C$82:$G$82)), 1)","v":1}]
[null,"SATISFACCIÓN",null,null,null,null,null,{"$f":"IF((SUMIF(C84:G84,\"X\",$C$82:$G$82)),(SUMIF(C84:G84,\"X\",$C$82:$G$82)), 1)","v":1}]
[null,"FASCINACIÓN",null,null,null,null,null,1]
[null,"ABURRIMIENTO",null,null,null,null,null,1]
[null,"ENFADO",null,null,null,null,null,1]
[null,"TRISTEZA",null,null,null,null,null,1]
[null,"VERGÜENZA",null,null,null,null,null,1]
[null,"MIEDO",null,null,null,null,null,1]
[null,"REPUGNANCIA",null,null,null,null,null,1]
[null,"DESEO",null,null,null,null,null,1]
[null,"ESPERANZA",null,null,null,null,null,1]
[null,"ORGULLO",null,null,null,null,null,1]
[]
[]
[]
[]
[null,"EMOCIONES \\ INTENSIDAD","NADA","POCO","MEDIANAMENTE","BASTANTE","MUCHO","VALORACIÓN"]
[null,null,1.00000000001,2,3,4,5]
[null,{"$f":"$B83","v":"ALEGRÍA"},null,null,null,null,null,{"$f":"IF((SUMIF(C101:G101,\"X\",$C$100:$G$100)),(SUMIF(C101:G101,\"X\",$C$100:$G$100)), 1)","v":1}]
[null,"SATISFACCIÓN",null,null,null,null,null,{"$f":"IF((SUMIF(C102:G102,\"X\",$C$100:$G$100)),(SUMIF(C102:G102,\"X\",$C$100:$G$100)), 1)","v":1}]
[null,"FASCINACIÓN",null,null,null,null,null,1]
[null,"ABURRIMIENTO",null,null,null,null,null,1]
[null,"ENFADO",null,null,null,null,null,1]
[null,"TRISTEZA",null,null,null,null,null,1]
[null,"VERGÜENZA",null,null,null,null,null,1]
[null,"MIEDO",null,null,null,null,null,1]
[null,"REPUGNANCIA",null,null,null,null,null,1]
[null,"DESEO",null,null,null,null,null,1]
[null,"ESPERANZA",null,null,null,null,null,1]
[null,"ORGULLO",null,null,null,null,null,1]

{"sheet":"User23","index":23,"n_rows":112,"n_cols":13,"rows_kept":112,"cut":false,"hidden":false,"merged":[[98,1,99,1],[98,7,99,7],[44,1,45,1],[44,7,45,7],[62,1,63,1],[62,7,63,7],[80,1,81,1],[80,7,81,7],[0,1,0,17],[2,13,5,17],[10,1,11,1],[10,7,11,7],[27,1,28,1],[27,7,28,7]]}
[null,"ESTAS TABLAS UTILIZAN MACROS DE EXCEL, POR LO TANTO CUANDO SE LE CONSULTE AL ABRIR EL ARCHIVO DEBE ACEPTAR Y HABILITAR LAS MACROS PARA QUE FUNCIONEN CORRECTAMENTE"]
[]
[null,"VALORACIÓN EMOCIONAL DE PRODUCTOS, MATERIALES O SERVICIOS",null,null,null,null,null,null,"GÉNERO:",null,"EDAD:",null,"OBS:"]
[]
[null,"DÍGANOS COMO SE SIENTE RESPECTO A CADA PRODUCTO, MATERIAL O SERVICIO"]
[null,"· ESCOJA ENTRE 3 Y 5 EMOCIONES QUE UD. EXPERIMENTE CON MAYOR INTENSIDAD"]
[null,"· MARQUE CON UNA X LAS EMOCIONES Y LOS NIVELES DE INTENSIDAD ESCOGIDOS"]
[null,"· MARQUE SUS PREFERENCIAS CON UN DOBLE CLIC EN LA CELDA ESCOGIDA (PUEDE BORRAR DEL MISMO MODO)"]
[]
[]
[null,"EMOCIONES \\ INTENSIDAD","NADA","POCO","MEDIANAMENTE","BASTANTE","MUCHO","VALORACIÓN"]
[null,null,1.00000000001,2,3,4,5]
[null,{"$f":"User01!B13","v":"ALEGRÍA"},null,null,null,null,null,{"$f":"IF((SUMIF(C13:G13,\"X\",$C$12:$G$12)),(SUMIF(C13:G13,\"X\",$C$12:$G$12)), 1)","v":1}]
[null,{"$f":"User01!B14","v":"SATISFACCIÓN"},null,null,null,null,null,{"$f":"IF((SUMIF(C14:G14,\"X\",$C$12:$G$12)),(SUMIF(C14:G14,\"X\",$C$12:$G$12)), 1)","v":1}]
[null,{"$f":"User01!B15","v":"FASCINACIÓN"},null,null,null,null,null,1]
[null,{"$f":"User01!B16","v":"ABURRIMIENTO"},null,null,null,null,null,1]
[null,{"$f":"User01!B17","v":"ENFADO"},null,null,null,null,null,1]
[null,{"$f":"User01!B18","v":"TRISTEZA"},null,null,null,null,null,1]
[null,{"$f":"User01!B19","v":"VERGÜENZA"},null,null,null,null,null,1]
[null,{"$f":"User01!B20","v":"MIEDO"},null,null,null,null,null,1]
[null,{"$f":"User01!B21","v":"REPUGNANCIA"},null,null,null,null,null,1]
[null,{"$f":"User01!B22","v":"DESEO"},null,null,null,null,null,1]
[null,{"$f":"User01!B23","v":"ESPERANZA"},null,null,null,null,null,1]
[null,{"$f":"User01!B24","v":"ORGULLO"},null,null,null,null,null,1]
[]
[]
[]
[null,"EMOCIONES \\ INTENSIDAD","NADA","POCO","MEDIANAMENTE","BASTANTE","MUCHO","VALORACIÓN"]
[null,null,1.00000000001,2,3,4,5]
[null,{"$f":"$B13","v":"ALEGRÍA"},null,null,null,null,null,{"$f":"IF((SUMIF(C30:G30,\"X\",$C$29:$G$29)),(SUMIF(C30:G30,\"X\",$C$29:$G$29)), 1)","v":1}]
[null,"SATISFACCIÓN",null,null,null,null,null,{"$f":"IF((SUMIF(C31:G31,\"X\",$C$29:$G$29)),(SUMIF(C31:G31,\"X\",$C$29:$G$29)), 1)","v":1}]
[null,"FASCINACIÓN",null,null,null,null,null,1]
[null,"ABURRIMIENTO",null,null,null,null,null,1]
[null,"ENFADO",null,null,null,null,null,1]
[null,"TRISTEZA",null,null,null,null,null,1]
[null,"VERGÜENZA",null,null,null,null,null,1]
[null,"MIEDO",null,null,null,null,null,1]
[null,"REPUGNANCIA",null,null,null,null,null,1]
[null,"DESEO",null,null,null,null,null,1]
[null,"ESPERANZA",null,null,null,null,null,1]
[null,"ORGULLO",null,null,null,null,null,1]
[]
[]
[]
[null,"EMOCIONES \\ INTENSIDAD","NADA","POCO","MEDIANAMENTE","BASTANTE","MUCHO","VALORACIÓN"]
[null,null,1.00000000001,2,3,4,5]
[null,{"$f":"$B30","v":"ALEGRÍA"},null,null,null,null,null,{"$f":"IF((SUMIF(C47:G47,\"X\",$C$46:$G$46)),(SUMIF(C47:G47,\"X\",$C$46:$G$46)), 1)","v":1}]
[null,"SATISFACCIÓN",null,null,null,null,null,{"$f":"IF((SUMIF(C48:G48,\"X\",$C$46:$G$46)),(SUMIF(C48:G48,\"X\",$C$46:$G$46)), 1)","v":1}]
[null,"FASCINACIÓN",null,null,null,null,null,1]
[null,"ABURRIMIENTO",null,null,null,null,null,1]
[null,"ENFADO",null,null,null,null,null,1]
[null,"TRISTEZA",null,null,null,null,null,1]
[null,"VERGÜENZA",null,null,null,null,null,1]
[null,"MIEDO",null,null,null,null,null,1]
[null,"REPUGNANCIA",null,null,null,null,null,1]
[null,"DESEO",null,null,null,null,null,1]
[null,"ESPERANZA",null,null,null,null,null,1]
[null,"ORGULLO",null,null,null,null,null,1]
[]
[]
[]
[]
[null,"EMOCIONES \\ INTENSIDAD","NADA","POCO","MEDIANAMENTE","BASTANTE","MUCHO","VALORACIÓN"]
[null,null,1.00000000001,2,3,4,5]
[null,{"$f":"$B47","v":"ALEGRÍA"},null,null,null,null,null,{"$f":"IF((SUMIF(C65:G65,\"X\",$C$64:$G$64)),(SUMIF(C65:G65,\"X\",$C$64:$G$64)), 1)","v":1}]
[null,"SATISFACCIÓN",null,null,null,null,null,{"$f":"IF((SUMIF(C66:G66,\"X\",$C$64:$G$64)),(SUMIF(C66:G66,\"X\",$C$64:$G$64)), 1)","v":1}]
[null,"FASCINACIÓN",null,null,null,null,null,1]
[null,"ABURRIMIENTO",null,null,null,null,null,1]
[null,"ENFADO",null,null,null,null,null,1]
[null,"TRISTEZA",null,null,null,null,null,1]
[null,"VERGÜENZA",null,null,null,null,null,1]
[null,"MIEDO",null,null,null,null,null,1]
[null,"REPUGNANCIA",null,null,null,null,null,1]
[null,"DESEO",null,null,null,null,null,1]
[null,"ESPERANZA",null,null,null,null,null,1]
[null,"ORGULLO",null,null,null,null,null,1]
[]
[]
[]
[]
[null,"EMOCIONES \\ INTENSIDAD","NADA","POCO","MEDIANAMENTE","BASTANTE","MUCHO","VALORACIÓN"]
[null,null,1.00000000001,2,3,4,5]
[null,{"$f":"$B65","v":"ALEGRÍA"},null,null,null,null,null,{"$f":"IF((SUMIF(C83:G83,\"X\",$C$82:$G$82)),(SUMIF(C83:G83,\"X\",$C$82:$G$82)), 1)","v":1}]
[null,"SATISFACCIÓN",null,null,null,null,null,{"$f":"IF((SUMIF(C84:G84,\"X\",$C$82:$G$82)),(SUMIF(C84:G84,\"X\",$C$82:$G$82)), 1)","v":1}]
[null,"FASCINACIÓN",null,null,null,null,null,1]
[null,"ABURRIMIENTO",null,null,null,null,null,1]
[null,"ENFADO",null,null,null,null,null,1]
[null,"TRISTEZA",null,null,null,null,null,1]
[null,"VERGÜENZA",null,null,null,null,null,1]
[null,"MIEDO",null,null,null,null,null,1]
[null,"REPUGNANCIA",null,null,null,null,null,1]
[null,"DESEO",null,null,null,null,null,1]
[null,"ESPERANZA",null,null,null,null,null,1]
[null,"ORGULLO",null,null,null,null,null,1]
[]
[]
[]
[]
[null,"EMOCIONES \\ INTENSIDAD","NADA","POCO","MEDIANAMENTE","BASTANTE","MUCHO","VALORACIÓN"]
[null,null,1.00000000001,2,3,4,5]
[null,{"$f":"$B83","v":"ALEGRÍA"},null,null,null,null,null,{"$f":"IF((SUMIF(C101:G101,\"X\",$C$100:$G$100)),(SUMIF(C101:G101,\"X\",$C$100:$G$100)), 1)","v":1}]
[null,"SATISFACCIÓN",null,null,null,null,null,{"$f":"IF((SUMIF(C102:G102,\"X\",$C$100:$G$100)),(SUMIF(C102:G102,\"X\",$C$100:$G$100)), 1)","v":1}]
[null,"FASCINACIÓN",null,null,null,null,null,1]
[null,"ABURRIMIENTO",null,null,null,null,null,1]
[null,"ENFADO",null,null,null,null,null,1]
[null,"TRISTEZA",null,null,null,null,null,1]
[null,"VERGÜENZA",null,null,null,null,null,1]
[null,"MIEDO",null,null,null,null,null,1]
[null,"REPUGNANCIA",null,null,null,null,null,1]
[null,"DESEO",null,null,null,null,null,1]
[null,"ESPERANZA",null,null,null,null,null,1]
[null,"ORGULLO",null,null,null,null,null,1]

{"sheet":"User24","index":24,"n_rows":112,"n_cols":13,"rows_kept":112,"cut":false,"hidden":false,"merged":[[98,1,99,1],[98,7,99,7],[44,1,45,1],[44,7,45,7],[62,1,63,1],[62,7,63,7],[80,1,81,1],[80,7,81,7],[0,1,0,17],[2,13,5,17],[10,1,11,1],[10,7,11,7],[27,1,28,1],[27,7,28,7]]}
[null,"ESTAS TABLAS UTILIZAN MACROS DE EXCEL, POR LO TANTO CUANDO SE LE CONSULTE AL ABRIR EL ARCHIVO DEBE ACEPTAR Y HABILITAR LAS MACROS PARA QUE FUNCIONEN CORRECTAMENTE"]
[]
[null,"VALORACIÓN EMOCIONAL DE PRODUCTOS, MATERIALES O SERVICIOS",null,null,null,null,null,null,"GÉNERO:",null,"EDAD:",null,"OBS:"]
[]
[null,"DÍGANOS COMO SE SIENTE RESPECTO A CADA PRODUCTO, MATERIAL O SERVICIO"]
[null,"· ESCOJA ENTRE 3 Y 5 EMOCIONES QUE UD. EXPERIMENTE CON MAYOR INTENSIDAD"]
[null,"· MARQUE CON UNA X LAS EMOCIONES Y LOS NIVELES DE INTENSIDAD ESCOGIDOS"]
[null,"· MARQUE SUS PREFERENCIAS CON UN DOBLE CLIC EN LA CELDA ESCOGIDA (PUEDE BORRAR DEL MISMO MODO)"]
[]
[]
[null,"EMOCIONES \\ INTENSIDAD","NADA","POCO","MEDIANAMENTE","BASTANTE","MUCHO","VALORACIÓN"]
[null,null,1.00000000001,2,3,4,5]
[null,{"$f":"User01!B13","v":"ALEGRÍA"},null,null,null,null,null,{"$f":"IF((SUMIF(C13:G13,\"X\",$C$12:$G$12)),(SUMIF(C13:G13,\"X\",$C$12:$G$12)), 1)","v":1}]
[null,{"$f":"User01!B14","v":"SATISFACCIÓN"},null,null,null,null,null,{"$f":"IF((SUMIF(C14:G14,\"X\",$C$12:$G$12)),(SUMIF(C14:G14,\"X\",$C$12:$G$12)), 1)","v":1}]
[null,{"$f":"User01!B15","v":"FASCINACIÓN"},null,null,null,null,null,1]
[null,{"$f":"User01!B16","v":"ABURRIMIENTO"},null,null,null,null,null,1]
[null,{"$f":"User01!B17","v":"ENFADO"},null,null,null,null,null,1]
[null,{"$f":"User01!B18","v":"TRISTEZA"},null,null,null,null,null,1]
[null,{"$f":"User01!B19","v":"VERGÜENZA"},null,null,null,null,null,1]
[null,{"$f":"User01!B20","v":"MIEDO"},null,null,null,null,null,1]
[null,{"$f":"User01!B21","v":"REPUGNANCIA"},null,null,null,null,null,1]
[null,{"$f":"User01!B22","v":"DESEO"},null,null,null,null,null,1]
[null,{"$f":"User01!B23","v":"ESPERANZA"},null,null,null,null,null,1]
[null,{"$f":"User01!B24","v":"ORGULLO"},null,null,null,null,null,1]
[]
[]
[]
[null,"EMOCIONES \\ INTENSIDAD","NADA","POCO","MEDIANAMENTE","BASTANTE","MUCHO","VALORACIÓN"]
[null,null,1.00000000001,2,3,4,5]
[null,{"$f":"$B13","v":"ALEGRÍA"},null,null,null,null,null,{"$f":"IF((SUMIF(C30:G30,\"X\",$C$29:$G$29)),(SUMIF(C30:G30,\"X\",$C$29:$G$29)), 1)","v":1}]
[null,"SATISFACCIÓN",null,null,null,null,null,{"$f":"IF((SUMIF(C31:G31,\"X\",$C$29:$G$29)),(SUMIF(C31:G31,\"X\",$C$29:$G$29)), 1)","v":1}]
[null,"FASCINACIÓN",null,null,null,null,null,1]
[null,"ABURRIMIENTO",null,null,null,null,null,1]
[null,"ENFADO",null,null,null,null,null,1]
[null,"TRISTEZA",null,null,null,null,null,1]
[null,"VERGÜENZA",null,null,null,null,null,1]
[null,"MIEDO",null,null,null,null,null,1]
[null,"REPUGNANCIA",null,null,null,null,null,1]
[null,"DESEO",null,null,null,null,null,1]
[null,"ESPERANZA",null,null,null,null,null,1]
[null,"ORGULLO",null,null,null,null,null,1]
[]
[]
[]
[null,"EMOCIONES \\ INTENSIDAD","NADA","POCO","MEDIANAMENTE","BASTANTE","MUCHO","VALORACIÓN"]
[null,null,1.00000000001,2,3,4,5]
[null,{"$f":"$B30","v":"ALEGRÍA"},null,null,null,null,null,{"$f":"IF((SUMIF(C47:G47,\"X\",$C$46:$G$46)),(SUMIF(C47:G47,\"X\",$C$46:$G$46)), 1)","v":1}]
[null,"SATISFACCIÓN",null,null,null,null,null,{"$f":"IF((SUMIF(C48:G48,\"X\",$C$46:$G$46)),(SUMIF(C48:G48,\"X\",$C$46:$G$46)), 1)","v":1}]
[null,"FASCINACIÓN",null,null,null,null,null,1]
[null,"ABURRIMIENTO",null,null,null,null,null,1]
[null,"ENFADO",null,null,null,null,null,1]
[null,"TRISTEZA",null,null,null,null,null,1]
[null,"VERGÜENZA",null,null,null,null,null,1]
[null,"MIEDO",null,null,null,null,null,1]
[null,"REPUGNANCIA",null,null,null,null,null,1]
[null,"DESEO",null,null,null,null,null,1]
[null,"ESPERANZA",null,null,null,null,null,1]
[null,"ORGULLO",null,null,null,null,null,1]
[]
[]
[]
[]
[null,"EMOCIONES \\ INTENSIDAD","NADA","POCO","MEDIANAMENTE","BASTANTE","MUCHO","VALORACIÓN"]
[null,null,1.00000000001,2,3,4,5]
[null,{"$f":"$B47","v":"ALEGRÍA"},null,null,null,null,null,{"$f":"IF((SUMIF(C65:G65,\"X\",$C$64:$G$64)),(SUMIF(C65:G65,\"X\",$C$64:$G$64)), 1)","v":1}]
[null,"SATISFACCIÓN",null,null,null,null,null,{"$f":"IF((SUMIF(C66:G66,\"X\",$C$64:$G$64)),(SUMIF(C66:G66,\"X\",$C$64:$G$64)), 1)","v":1}]
[null,"FASCINACIÓN",null,null,null,null,null,1]
[null,"ABURRIMIENTO",null,null,null,null,null,1]
[null,"ENFADO",null,null,null,null,null,1]
[null,"TRISTEZA",null,null,null,null,null,1]
[null,"VERGÜENZA",null,null,null,null,null,1]
[null,"MIEDO",null,null,null,null,null,1]
[null,"REPUGNANCIA",null,null,null,null,null,1]
[null,"DESEO",null,null,null,null,null,1]
[null,"ESPERANZA",null,null,null,null,null,1]
[null,"ORGULLO",null,null,null,null,null,1]
[]
[]
[]
[]
[null,"EMOCIONES \\ INTENSIDAD","NADA","POCO","MEDIANAMENTE","BASTANTE","MUCHO","VALORACIÓN"]
[null,null,1.00000000001,2,3,4,5]
[null,{"$f":"$B65","v":"ALEGRÍA"},null,null,null,null,null,{"$f":"IF((SUMIF(C83:G83,\"X\",$C$82:$G$82)),(SUMIF(C83:G83,\"X\",$C$82:$G$82)), 1)","v":1}]
[null,"SATISFACCIÓN",null,null,null,null,null,{"$f":"IF((SUMIF(C84:G84,\"X\",$C$82:$G$82)),(SUMIF(C84:G84,\"X\",$C$82:$G$82)), 1)","v":1}]
[null,"FASCINACIÓN",null,null,null,null,null,1]
[null,"ABURRIMIENTO",null,null,null,null,null,1]
[null,"ENFADO",null,null,null,null,null,1]
[null,"TRISTEZA",null,null,null,null,null,1]
[null,"VERGÜENZA",null,null,null,null,null,1]
[null,"MIEDO",null,null,null,null,null,1]
[null,"REPUGNANCIA",null,null,null,null,null,1]
[null,"DESEO",null,null,null,null,null,1]
[null,"ESPERANZA",null,null,null,null,null,1]
[null,"ORGULLO",null,null,null,null,null,1]
[]
[]
[]
[]
[null,"EMOCIONES \\ INTENSIDAD","NADA","POCO","MEDIANAMENTE","BASTANTE","MUCHO","VALORACIÓN"]
[null,null,1.00000000001,2,3,4,5]
[null,{"$f":"$B83","v":"ALEGRÍA"},null,null,null,null,null,{"$f":"IF((SUMIF(C101:G101,\"X\",$C$100:$G$100)),(SUMIF(C101:G101,\"X\",$C$100:$G$100)), 1)","v":1}]
[null,"SATISFACCIÓN",null,null,null,null,null,{"$f":"IF((SUMIF(C102:G102,\"X\",$C$100:$G$100)),(SUMIF(C102:G102,\"X\",$C$100:$G$100)), 1)","v":1}]
[null,"FASCINACIÓN",null,null,null,null,null,1]
[null,"ABURRIMIENTO",null,null,null,null,null,1]
[null,"ENFADO",null,null,null,null,null,1]
[null,"TRISTEZA",null,null,null,null,null,1]
[null,"VERGÜENZA",null,null,null,null,null,1]
[null,"MIEDO",null,null,null,null,null,1]
[null,"REPUGNANCIA",null,null,null,null,null,1]
[null,"DESEO",null,null,null,null,null,1]
[null,"ESPERANZA",null,null,null,null,null,1]
[null,"ORGULLO",null,null,null,null,null,1]

{"sheet":"User25","index":25,"n_rows":112,"n_cols":13,"rows_kept":112,"cut":false,"hidden":false,"merged":[[98,1,99,1],[98,7,99,7],[44,1,45,1],[44,7,45,7],[62,1,63,1],[62,7,63,7],[80,1,81,1],[80,7,81,7],[0,1,0,17],[2,13,5,17],[10,1,11,1],[10,7,11,7],[27,1,28,1],[27,7,28,7]]}
[null,"ESTAS TABLAS UTILIZAN MACROS DE EXCEL, POR LO TANTO CUANDO SE LE CONSULTE AL ABRIR EL ARCHIVO DEBE ACEPTAR Y HABILITAR LAS MACROS PARA QUE FUNCIONEN CORRECTAMENTE"]
[]
[null,"VALORACIÓN EMOCIONAL DE PRODUCTOS, MATERIALES O SERVICIOS",null,null,null,null,null,null,"GÉNERO:",null,"EDAD:",null,"OBS:"]
[]
[null,"DÍGANOS COMO SE SIENTE RESPECTO A CADA PRODUCTO, MATERIAL O SERVICIO"]
[null,"· ESCOJA ENTRE 3 Y 5 EMOCIONES QUE UD. EXPERIMENTE CON MAYOR INTENSIDAD"]
[null,"· MARQUE CON UNA X LAS EMOCIONES Y LOS NIVELES DE INTENSIDAD ESCOGIDOS"]
[null,"· MARQUE SUS PREFERENCIAS CON UN DOBLE CLIC EN LA CELDA ESCOGIDA (PUEDE BORRAR DEL MISMO MODO)"]
[]
[]
[null,"EMOCIONES \\ INTENSIDAD","NADA","POCO","MEDIANAMENTE","BASTANTE","MUCHO","VALORACIÓN"]
[null,null,1.00000000001,2,3,4,5]
[null,{"$f":"User01!B13","v":"ALEGRÍA"},null,null,null,null,null,{"$f":"IF((SUMIF(C13:G13,\"X\",$C$12:$G$12)),(SUMIF(C13:G13,\"X\",$C$12:$G$12)), 1)","v":1}]
[null,{"$f":"User01!B14","v":"SATISFACCIÓN"},null,null,null,null,null,{"$f":"IF((SUMIF(C14:G14,\"X\",$C$12:$G$12)),(SUMIF(C14:G14,\"X\",$C$12:$G$12)), 1)","v":1}]
[null,{"$f":"User01!B15","v":"FASCINACIÓN"},null,null,null,null,null,1]
[null,{"$f":"User01!B16","v":"ABURRIMIENTO"},null,null,null,null,null,1]
[null,{"$f":"User01!B17","v":"ENFADO"},null,null,null,null,null,1]
[null,{"$f":"User01!B18","v":"TRISTEZA"},null,null,null,null,null,1]
[null,{"$f":"User01!B19","v":"VERGÜENZA"},null,null,null,null,null,1]
[null,{"$f":"User01!B20","v":"MIEDO"},null,null,null,null,null,1]
[null,{"$f":"User01!B21","v":"REPUGNANCIA"},null,null,null,null,null,1]
[null,{"$f":"User01!B22","v":"DESEO"},null,null,null,null,null,1]
[null,{"$f":"User01!B23","v":"ESPERANZA"},null,null,null,null,null,1]
[null,{"$f":"User01!B24","v":"ORGULLO"},null,null,null,null,null,1]
[]
[]
[]
[null,"EMOCIONES \\ INTENSIDAD","NADA","POCO","MEDIANAMENTE","BASTANTE","MUCHO","VALORACIÓN"]
[null,null,1.00000000001,2,3,4,5]
[null,{"$f":"$B13","v":"ALEGRÍA"},null,null,null,null,null,{"$f":"IF((SUMIF(C30:G30,\"X\",$C$29:$G$29)),(SUMIF(C30:G30,\"X\",$C$29:$G$29)), 1)","v":1}]
[null,"SATISFACCIÓN",null,null,null,null,null,{"$f":"IF((SUMIF(C31:G31,\"X\",$C$29:$G$29)),(SUMIF(C31:G31,\"X\",$C$29:$G$29)), 1)","v":1}]
[null,"FASCINACIÓN",null,null,null,null,null,1]
[null,"ABURRIMIENTO",null,null,null,null,null,1]
[null,"ENFADO",null,null,null,null,null,1]
[null,"TRISTEZA",null,null,null,null,null,1]
[null,"VERGÜENZA",null,null,null,null,null,1]
[null,"MIEDO",null,null,null,null,null,1]
[null,"REPUGNANCIA",null,null,null,null,null,1]
[null,"DESEO",null,null,null,null,null,1]
[null,"ESPERANZA",null,null,null,null,null,1]
[null,"ORGULLO",null,null,null,null,null,1]
[]
[]
[]
[null,"EMOCIONES \\ INTENSIDAD","NADA","POCO","MEDIANAMENTE","BASTANTE","MUCHO","VALORACIÓN"]
[null,null,1.00000000001,2,3,4,5]
[null,{"$f":"$B30","v":"ALEGRÍA"},null,null,null,null,null,{"$f":"IF((SUMIF(C47:G47,\"X\",$C$46:$G$46)),(SUMIF(C47:G47,\"X\",$C$46:$G$46)), 1)","v":1}]
[null,"SATISFACCIÓN",null,null,null,null,null,{"$f":"IF((SUMIF(C48:G48,\"X\",$C$46:$G$46)),(SUMIF(C48:G48,\"X\",$C$46:$G$46)), 1)","v":1}]
[null,"FASCINACIÓN",null,null,null,null,null,1]
[null,"ABURRIMIENTO",null,null,null,null,null,1]
[null,"ENFADO",null,null,null,null,null,1]
[null,"TRISTEZA",null,null,null,null,null,1]
[null,"VERGÜENZA",null,null,null,null,null,1]
[null,"MIEDO",null,null,null,null,null,1]
[null,"REPUGNANCIA",null,null,null,null,null,1]
[null,"DESEO",null,null,null,null,null,1]
[null,"ESPERANZA",null,null,null,null,null,1]
[null,"ORGULLO",null,null,null,null,null,1]
[]
[]
[]
[]
[null,"EMOCIONES \\ INTENSIDAD","NADA","POCO","MEDIANAMENTE","BASTANTE","MUCHO","VALORACIÓN"]
[null,null,1.00000000001,2,3,4,5]
[null,{"$f":"$B47","v":"ALEGRÍA"},null,null,null,null,null,{"$f":"IF((SUMIF(C65:G65,\"X\",$C$64:$G$64)),(SUMIF(C65:G65,\"X\",$C$64:$G$64)), 1)","v":1}]
[null,"SATISFACCIÓN",null,null,null,null,null,{"$f":"IF((SUMIF(C66:G66,\"X\",$C$64:$G$64)),(SUMIF(C66:G66,\"X\",$C$64:$G$64)), 1)","v":1}]
[null,"FASCINACIÓN",null,null,null,null,null,1]
[null,"ABURRIMIENTO",null,null,null,null,null,1]
[null,"ENFADO",null,null,null,null,null,1]
[null,"TRISTEZA",null,null,null,null,null,1]
[null,"VERGÜENZA",null,null,null,null,null,1]
[null,"MIEDO",null,null,null,null,null,1]
[null,"REPUGNANCIA",null,null,null,null,null,1]
[null,"DESEO",null,null,null,null,null,1]
[null,"ESPERANZA",null,null,null,null,null,1]
[null,"ORGULLO",null,null,null,null,null,1]
[]
[]
[]
[]
[null,"EMOCIONES \\ INTENSIDAD","NADA","POCO","MEDIANAMENTE","BASTANTE","MUCHO","VALORACIÓN"]
[null,null,1.00000000001,2,3,4,5]
[null,{"$f":"$B65","v":"ALEGRÍA"},null,null,null,null,null,{"$f":"IF((SUMIF(C83:G83,\"X\",$C$82:$G$82)),(SUMIF(C83:G83,\"X\",$C$82:$G$82)), 1)","v":1}]
[null,"SATISFACCIÓN",null,null,null,null,null,{"$f":"IF((SUMIF(C84:G84,\"X\",$C$82:$G$82)),(SUMIF(C84:G84,\"X\",$C$82:$G$82)), 1)","v":1}]
[null,"FASCINACIÓN",null,null,null,null,null,1]
[null,"ABURRIMIENTO",null,null,null,null,null,1]
[null,"ENFADO",null,null,null,null,null,1]
[null,"TRISTEZA",null,null,null,null,null,1]
[null,"VERGÜENZA",null,null,null,null,null,1]
[null,"MIEDO",null,null,null,null,null,1]
[null,"REPUGNANCIA",null,null,null,null,null,1]
[null,"DESEO",null,null,null,null,null,1]
[null,"ESPERANZA",null,null,null,null,null,1]
[null,"ORGULLO",null,null,null,null,null,1]
[]
[]
[]
[]
[null,"EMOCIONES \\ INTENSIDAD","NADA","POCO","MEDIANAMENTE","BASTANTE","MUCHO","VALORACIÓN"]
[null,null,1.00000000001,2,3,4,5]
[null,{"$f":"$B83","v":"ALEGRÍA"},null,null,null,null,null,{"$f":"IF((SUMIF(C101:G101,\"X\",$C$100:$G$100)),(SUMIF(C101:G101,\"X\",$C$100:$G$100)), 1)","v":1}]
[null,"SATISFACCIÓN",null,null,null,null,null,{"$f":"IF((SUMIF(C102:G102,\"X\",$C$100:$G$100)),(SUMIF(C102:G102,\"X\",$C$100:$G$100)), 1)","v":1}]
[null,"FASCINACIÓN",null,null,null,null,null,1]
[null,"ABURRIMIENTO",null,null,null,null,null,1]
[null,"ENFADO",null,null,null,null,null,1]
[null,"TRISTEZA",null,null,null,null,null,1]
[null,"VERGÜENZA",null,null,null,null,null,1]
[null,"MIEDO",null,null,null,null,null,1]
[null,"REPUGNANCIA",null,null,null,null,null,1]
[null,"DESEO",null,null,null,null,null,1]
[null,"ESPERANZA",null,null,null,null,null,1]
[null,"ORGULLO",null,null,null,null,null,1]

{"sheet":"User26","index":26,"n_rows":112,"n_cols":13,"rows_kept":112,"cut":false,"hidden":false,"merged":[[98,1,99,1],[98,7,99,7],[44,1,45,1],[44,7,45,7],[62,1,63,1],[62,7,63,7],[80,1,81,1],[80,7,81,7],[0,1,0,17],[2,13,5,17],[10,1,11,1],[10,7,11,7],[27,1,28,1],[27,7,28,7]]}
[null,"ESTAS TABLAS UTILIZAN MACROS DE EXCEL, POR LO TANTO CUANDO SE LE CONSULTE AL ABRIR EL ARCHIVO DEBE ACEPTAR Y HABILITAR LAS MACROS PARA QUE FUNCIONEN CORRECTAMENTE"]
[]
[null,"VALORACIÓN EMOCIONAL DE PRODUCTOS, MATERIALES O SERVICIOS",null,null,null,null,null,null,"GÉNERO:",null,"EDAD:",null,"OBS:"]
[]
[null,"DÍGANOS COMO SE SIENTE RESPECTO A CADA PRODUCTO, MATERIAL O SERVICIO"]
[null,"· ESCOJA ENTRE 3 Y 5 EMOCIONES QUE UD. EXPERIMENTE CON MAYOR INTENSIDAD"]
[null,"· MARQUE CON UNA X LAS EMOCIONES Y LOS NIVELES DE INTENSIDAD ESCOGIDOS"]
[null,"· MARQUE SUS PREFERENCIAS CON UN DOBLE CLIC EN LA CELDA ESCOGIDA (PUEDE BORRAR DEL MISMO MODO)"]
[]
[]
[null,"EMOCIONES \\ INTENSIDAD","NADA","POCO","MEDIANAMENTE","BASTANTE","MUCHO","VALORACIÓN"]
[null,null,1.00000000001,2,3,4,5]
[null,{"$f":"User01!B13","v":"ALEGRÍA"},null,null,null,null,null,{"$f":"IF((SUMIF(C13:G13,\"X\",$C$12:$G$12)),(SUMIF(C13:G13,\"X\",$C$12:$G$12)), 1)","v":1}]
[null,{"$f":"User01!B14","v":"SATISFACCIÓN"},null,null,null,null,null,{"$f":"IF((SUMIF(C14:G14,\"X\",$C$12:$G$12)),(SUMIF(C14:G14,\"X\",$C$12:$G$12)), 1)","v":1}]
[null,{"$f":"User01!B15","v":"FASCINACIÓN"},null,null,null,null,null,1]
[null,{"$f":"User01!B16","v":"ABURRIMIENTO"},null,null,null,null,null,1]
[null,{"$f":"User01!B17","v":"ENFADO"},null,null,null,null,null,1]
[null,{"$f":"User01!B18","v":"TRISTEZA"},null,null,null,null,null,1]
[null,{"$f":"User01!B19","v":"VERGÜENZA"},null,null,null,null,null,1]
[null,{"$f":"User01!B20","v":"MIEDO"},null,null,null,null,null,1]
[null,{"$f":"User01!B21","v":"REPUGNANCIA"},null,null,null,null,null,1]
[null,{"$f":"User01!B22","v":"DESEO"},null,null,null,null,null,1]
[null,{"$f":"User01!B23","v":"ESPERANZA"},null,null,null,null,null,1]
[null,{"$f":"User01!B24","v":"ORGULLO"},null,null,null,null,null,1]
[]
[]
[]
[null,"EMOCIONES \\ INTENSIDAD","NADA","POCO","MEDIANAMENTE","BASTANTE","MUCHO","VALORACIÓN"]
[null,null,1.00000000001,2,3,4,5]
[null,{"$f":"$B13","v":"ALEGRÍA"},null,null,null,null,null,{"$f":"IF((SUMIF(C30:G30,\"X\",$C$29:$G$29)),(SUMIF(C30:G30,\"X\",$C$29:$G$29)), 1)","v":1}]
[null,"SATISFACCIÓN",null,null,null,null,null,{"$f":"IF((SUMIF(C31:G31,\"X\",$C$29:$G$29)),(SUMIF(C31:G31,\"X\",$C$29:$G$29)), 1)","v":1}]
[null,"FASCINACIÓN",null,null,null,null,null,1]
[null,"ABURRIMIENTO",null,null,null,null,null,1]
[null,"ENFADO",null,null,null,null,null,1]
[null,"TRISTEZA",null,null,null,null,null,1]
[null,"VERGÜENZA",null,null,null,null,null,1]
[null,"MIEDO",null,null,null,null,null,1]
[null,"REPUGNANCIA",null,null,null,null,null,1]
[null,"DESEO",null,null,null,null,null,1]
[null,"ESPERANZA",null,null,null,null,null,1]
[null,"ORGULLO",null,null,null,null,null,1]
[]
[]
[]
[null,"EMOCIONES \\ INTENSIDAD","NADA","POCO","MEDIANAMENTE","BASTANTE","MUCHO","VALORACIÓN"]
[null,null,1.00000000001,2,3,4,5]
[null,{"$f":"$B30","v":"ALEGRÍA"},null,null,null,null,null,{"$f":"IF((SUMIF(C47:G47,\"X\",$C$46:$G$46)),(SUMIF(C47:G47,\"X\",$C$46:$G$46)), 1)","v":1}]
[null,"SATISFACCIÓN",null,null,null,null,null,{"$f":"IF((SUMIF(C48:G48,\"X\",$C$46:$G$46)),(SUMIF(C48:G48,\"X\",$C$46:$G$46)), 1)","v":1}]
[null,"FASCINACIÓN",null,null,null,null,null,1]
[null,"ABURRIMIENTO",null,null,null,null,null,1]
[null,"ENFADO",null,null,null,null,null,1]
[null,"TRISTEZA",null,null,null,null,null,1]
[null,"VERGÜENZA",null,null,null,null,null,1]
[null,"MIEDO",null,null,null,null,null,1]
[null,"REPUGNANCIA",null,null,null,null,null,1]
[null,"DESEO",null,null,null,null,null,1]
[null,"ESPERANZA",null,null,null,null,null,1]
[null,"ORGULLO",null,null,null,null,null,1]
[]
[]
[]
[]
[null,"EMOCIONES \\ INTENSIDAD","NADA","POCO","MEDIANAMENTE","BASTANTE","MUCHO","VALORACIÓN"]
[null,null,1.00000000001,2,3,4,5]
[null,{"$f":"$B47","v":"ALEGRÍA"},null,null,null,null,null,{"$f":"IF((SUMIF(C65:G65,\"X\",$C$64:$G$64)),(SUMIF(C65:G65,\"X\",$C$64:$G$64)), 1)","v":1}]
[null,"SATISFACCIÓN",null,null,null,null,null,{"$f":"IF((SUMIF(C66:G66,\"X\",$C$64:$G$64)),(SUMIF(C66:G66,\"X\",$C$64:$G$64)), 1)","v":1}]
[null,"FASCINACIÓN",null,null,null,null,null,1]
[null,"ABURRIMIENTO",null,null,null,null,null,1]
[null,"ENFADO",null,null,null,null,null,1]
[null,"TRISTEZA",null,null,null,null,null,1]
[null,"VERGÜENZA",null,null,null,null,null,1]
[null,"MIEDO",null,null,null,null,null,1]
[null,"REPUGNANCIA",null,null,null,null,null,1]
[null,"DESEO",null,null,null,null,null,1]
[null,"ESPERANZA",null,null,null,null,null,1]
[null,"ORGULLO",null,null,null,null,null,1]
[]
[]
[]
[]
[null,"EMOCIONES \\ INTENSIDAD","NADA","POCO","MEDIANAMENTE","BASTANTE","MUCHO","VALORACIÓN"]
[null,null,1.00000000001,2,3,4,5]
[null,{"$f":"$B65","v":"ALEGRÍA"},null,null,null,null,null,{"$f":"IF((SUMIF(C83:G83,\"X\",$C$82:$G$82)),(SUMIF(C83:G83,\"X\",$C$82:$G$82)), 1)","v":1}]
[null,"SATISFACCIÓN",null,null,null,null,null,{"$f":"IF((SUMIF(C84:G84,\"X\",$C$82:$G$82)),(SUMIF(C84:G84,\"X\",$C$82:$G$82)), 1)","v":1}]
[null,"FASCINACIÓN",null,null,null,null,null,1]
[null,"ABURRIMIENTO",null,null,null,null,null,1]
[null,"ENFADO",null,null,null,null,null,1]
[null,"TRISTEZA",null,null,null,null,null,1]
[null,"VERGÜENZA",null,null,null,null,null,1]
[null,"MIEDO",null,null,null,null,null,1]
[null,"REPUGNANCIA",null,null,null,null,null,1]
[null,"DESEO",null,null,null,null,null,1]
[null,"ESPERANZA",null,null,null,null,null,1]
[null,"ORGULLO",null,null,null,null,null,1]
[]
[]
[]
[]
[null,"EMOCIONES \\ INTENSIDAD","NADA","POCO","MEDIANAMENTE","BASTANTE","MUCHO","VALORACIÓN"]
[null,null,1.00000000001,2,3,4,5]
[null,{"$f":"$B83","v":"ALEGRÍA"},null,null,null,null,null,{"$f":"IF((SUMIF(C101:G101,\"X\",$C$100:$G$100)),(SUMIF(C101:G101,\"X\",$C$100:$G$100)), 1)","v":1}]
[null,"SATISFACCIÓN",null,null,null,null,null,{"$f":"IF((SUMIF(C102:G102,\"X\",$C$100:$G$100)),(SUMIF(C102:G102,\"X\",$C$100:$G$100)), 1)","v":1}]
[null,"FASCINACIÓN",null,null,null,null,null,1]
[null,"ABURRIMIENTO",null,null,null,null,null,1]
[null,"ENFADO",null,null,null,null,null,1]
[null,"TRISTEZA",null,null,null,null,null,1]
[null,"VERGÜENZA",null,null,null,null,null,1]
[null,"MIEDO",null,null,null,null,null,1]
[null,"REPUGNANCIA",null,null,null,null,null,1]
[null,"DESEO",null,null,null,null,null,1]
[null,"ESPERANZA",null,null,null,null,null,1]
[null,"ORGULLO",null,null,null,null,null,1]

{"sheet":"User27","index":27,"n_rows":112,"n_cols":13,"rows_kept":112,"cut":false,"hidden":false,"merged":[[98,1,99,1],[98,7,99,7],[44,1,45,1],[44,7,45,7],[62,1,63,1],[62,7,63,7],[80,1,81,1],[80,7,81,7],[0,1,0,17],[2,13,5,17],[10,1,11,1],[10,7,11,7],[27,1,28,1],[27,7,28,7]]}
[null,"ESTAS TABLAS UTILIZAN MACROS DE EXCEL, POR LO TANTO CUANDO SE LE CONSULTE AL ABRIR EL ARCHIVO DEBE ACEPTAR Y HABILITAR LAS MACROS PARA QUE FUNCIONEN CORRECTAMENTE"]
[]
[null,"VALORACIÓN EMOCIONAL DE PRODUCTOS, MATERIALES O SERVICIOS",null,null,null,null,null,null,"GÉNERO:",null,"EDAD:",null,"OBS:"]
[]
[null,"DÍGANOS COMO SE SIENTE RESPECTO A CADA PRODUCTO, MATERIAL O SERVICIO"]
[null,"· ESCOJA ENTRE 3 Y 5 EMOCIONES QUE UD. EXPERIMENTE CON MAYOR INTENSIDAD"]
[null,"· MARQUE CON UNA X LAS EMOCIONES Y LOS NIVELES DE INTENSIDAD ESCOGIDOS"]
[null,"· MARQUE SUS PREFERENCIAS CON UN DOBLE CLIC EN LA CELDA ESCOGIDA (PUEDE BORRAR DEL MISMO MODO)"]
[]
[]
[null,"EMOCIONES \\ INTENSIDAD","NADA","POCO","MEDIANAMENTE","BASTANTE","MUCHO","VALORACIÓN"]
[null,null,1.00000000001,2,3,4,5]
[null,{"$f":"User01!B13","v":"ALEGRÍA"},null,null,null,null,null,{"$f":"IF((SUMIF(C13:G13,\"X\",$C$12:$G$12)),(SUMIF(C13:G13,\"X\",$C$12:$G$12)), 1)","v":1}]
[null,{"$f":"User01!B14","v":"SATISFACCIÓN"},null,null,null,null,null,{"$f":"IF((SUMIF(C14:G14,\"X\",$C$12:$G$12)),(SUMIF(C14:G14,\"X\",$C$12:$G$12)), 1)","v":1}]
[null,{"$f":"User01!B15","v":"FASCINACIÓN"},null,null,null,null,null,1]
[null,{"$f":"User01!B16","v":"ABURRIMIENTO"},null,null,null,null,null,1]
[null,{"$f":"User01!B17","v":"ENFADO"},null,null,null,null,null,1]
[null,{"$f":"User01!B18","v":"TRISTEZA"},null,null,null,null,null,1]
[null,{"$f":"User01!B19","v":"VERGÜENZA"},null,null,null,null,null,1]
[null,{"$f":"User01!B20","v":"MIEDO"},null,null,null,null,null,1]
[null,{"$f":"User01!B21","v":"REPUGNANCIA"},null,null,null,null,null,1]
[null,{"$f":"User01!B22","v":"DESEO"},null,null,null,null,null,1]
[null,{"$f":"User01!B23","v":"ESPERANZA"},null,null,null,null,null,1]
[null,{"$f":"User01!B24","v":"ORGULLO"},null,null,null,null,null,1]
[]
[]
[]
[null,"EMOCIONES \\ INTENSIDAD","NADA","POCO","MEDIANAMENTE","BASTANTE","MUCHO","VALORACIÓN"]
[null,null,1.00000000001,2,3,4,5]
[null,{"$f":"$B13","v":"ALEGRÍA"},null,null,null,null,null,{"$f":"IF((SUMIF(C30:G30,\"X\",$C$29:$G$29)),(SUMIF(C30:G30,\"X\",$C$29:$G$29)), 1)","v":1}]
[null,"SATISFACCIÓN",null,null,null,null,null,{"$f":"IF((SUMIF(C31:G31,\"X\",$C$29:$G$29)),(SUMIF(C31:G31,\"X\",$C$29:$G$29)), 1)","v":1}]
[null,"FASCINACIÓN",null,null,null,null,null,1]
[null,"ABURRIMIENTO",null,null,null,null,null,1]
[null,"ENFADO",null,null,null,null,null,1]
[null,"TRISTEZA",null,null,null,null,null,1]
[null,"VERGÜENZA",null,null,null,null,null,1]
[null,"MIEDO",null,null,null,null,null,1]
[null,"REPUGNANCIA",null,null,null,null,null,1]
[null,"DESEO",null,null,null,null,null,1]
[null,"ESPERANZA",null,null,null,null,null,1]
[null,"ORGULLO",null,null,null,null,null,1]
[]
[]
[]
[null,"EMOCIONES \\ INTENSIDAD","NADA","POCO","MEDIANAMENTE","BASTANTE","MUCHO","VALORACIÓN"]
[null,null,1.00000000001,2,3,4,5]
[null,{"$f":"$B30","v":"ALEGRÍA"},null,null,null,null,null,{"$f":"IF((SUMIF(C47:G47,\"X\",$C$46:$G$46)),(SUMIF(C47:G47,\"X\",$C$46:$G$46)), 1)","v":1}]
[null,"SATISFACCIÓN",null,null,null,null,null,{"$f":"IF((SUMIF(C48:G48,\"X\",$C$46:$G$46)),(SUMIF(C48:G48,\"X\",$C$46:$G$46)), 1)","v":1}]
[null,"FASCINACIÓN",null,null,null,null,null,1]
[null,"ABURRIMIENTO",null,null,null,null,null,1]
[null,"ENFADO",null,null,null,null,null,1]
[null,"TRISTEZA",null,null,null,null,null,1]
[null,"VERGÜENZA",null,null,null,null,null,1]
[null,"MIEDO",null,null,null,null,null,1]
[null,"REPUGNANCIA",null,null,null,null,null,1]
[null,"DESEO",null,null,null,null,null,1]
[null,"ESPERANZA",null,null,null,null,null,1]
[null,"ORGULLO",null,null,null,null,null,1]
[]
[]
[]
[]
[null,"EMOCIONES \\ INTENSIDAD","NADA","POCO","MEDIANAMENTE","BASTANTE","MUCHO","VALORACIÓN"]
[null,null,1.00000000001,2,3,4,5]
[null,{"$f":"$B47","v":"ALEGRÍA"},null,null,null,null,null,{"$f":"IF((SUMIF(C65:G65,\"X\",$C$64:$G$64)),(SUMIF(C65:G65,\"X\",$C$64:$G$64)), 1)","v":1}]
[null,"SATISFACCIÓN",null,null,null,null,null,{"$f":"IF((SUMIF(C66:G66,\"X\",$C$64:$G$64)),(SUMIF(C66:G66,\"X\",$C$64:$G$64)), 1)","v":1}]
[null,"FASCINACIÓN",null,null,null,null,null,1]
[null,"ABURRIMIENTO",null,null,null,null,null,1]
[null,"ENFADO",null,null,null,null,null,1]
[null,"TRISTEZA",null,null,null,null,null,1]
[null,"VERGÜENZA",null,null,null,null,null,1]
[null,"MIEDO",null,null,null,null,null,1]
[null,"REPUGNANCIA",null,null,null,null,null,1]
[null,"DESEO",null,null,null,null,null,1]
[null,"ESPERANZA",null,null,null,null,null,1]
[null,"ORGULLO",null,null,null,null,null,1]
[]
[]
[]
[]
[null,"EMOCIONES \\ INTENSIDAD","NADA","POCO","MEDIANAMENTE","BASTANTE","MUCHO","VALORACIÓN"]
[null,null,1.00000000001,2,3,4,5]
[null,{"$f":"$B65","v":"ALEGRÍA"},null,null,null,null,null,{"$f":"IF((SUMIF(C83:G83,\"X\",$C$82:$G$82)),(SUMIF(C83:G83,\"X\",$C$82:$G$82)), 1)","v":1}]
[null,"SATISFACCIÓN",null,null,null,null,null,{"$f":"IF((SUMIF(C84:G84,\"X\",$C$82:$G$82)),(SUMIF(C84:G84,\"X\",$C$82:$G$82)), 1)","v":1}]
[null,"FASCINACIÓN",null,null,null,null,null,1]
[null,"ABURRIMIENTO",null,null,null,null,null,1]
[null,"ENFADO",null,null,null,null,null,1]
[null,"TRISTEZA",null,null,null,null,null,1]
[null,"VERGÜENZA",null,null,null,null,null,1]
[null,"MIEDO",null,null,null,null,null,1]
[null,"REPUGNANCIA",null,null,null,null,null,1]
[null,"DESEO",null,null,null,null,null,1]
[null,"ESPERANZA",null,null,null,null,null,1]
[null,"ORGULLO",null,null,null,null,null,1]
[]
[]
[]
[]
[null,"EMOCIONES \\ INTENSIDAD","NADA","POCO","MEDIANAMENTE","BASTANTE","MUCHO","VALORACIÓN"]
[null,null,1.00000000001,2,3,4,5]
[null,{"$f":"$B83","v":"ALEGRÍA"},null,null,null,null,null,{"$f":"IF((SUMIF(C101:G101,\"X\",$C$100:$G$100)),(SUMIF(C101:G101,\"X\",$C$100:$G$100)), 1)","v":1}]
[null,"SATISFACCIÓN",null,null,null,null,null,{"$f":"IF((SUMIF(C102:G102,\"X\",$C$100:$G$100)),(SUMIF(C102:G102,\"X\",$C$100:$G$100)), 1)","v":1}]
[null,"FASCINACIÓN",null,null,null,null,null,1]
[null,"ABURRIMIENTO",null,null,null,null,null,1]
[null,"ENFADO",null,null,null,null,null,1]
[null,"TRISTEZA",null,null,null,null,null,1]
[null,"VERGÜENZA",null,null,null,null,null,1]
[null,"MIEDO",null,null,null,null,null,1]
[null,"REPUGNANCIA",null,null,null,null,null,1]
[null,"DESEO",null,null,null,null,null,1]
[null,"ESPERANZA",null,null,null,null,null,1]
[null,"ORGULLO",null,null,null,null,null,1]

{"sheet":"User28","index":28,"n_rows":112,"n_cols":13,"rows_kept":112,"cut":false,"hidden":false,"merged":[[98,1,99,1],[98,7,99,7],[44,1,45,1],[44,7,45,7],[62,1,63,1],[62,7,63,7],[80,1,81,1],[80,7,81,7],[0,1,0,17],[2,13,5,17],[10,1,11,1],[10,7,11,7],[27,1,28,1],[27,7,28,7]]}
[null,"ESTAS TABLAS UTILIZAN MACROS DE EXCEL, POR LO TANTO CUANDO SE LE CONSULTE AL ABRIR EL ARCHIVO DEBE ACEPTAR Y HABILITAR LAS MACROS PARA QUE FUNCIONEN CORRECTAMENTE"]
[]
[null,"VALORACIÓN EMOCIONAL DE PRODUCTOS, MATERIALES O SERVICIOS",null,null,null,null,null,null,"GÉNERO:",null,"EDAD:",null,"OBS:"]
[]
[null,"DÍGANOS COMO SE SIENTE RESPECTO A CADA PRODUCTO, MATERIAL O SERVICIO"]
[null,"· ESCOJA ENTRE 3 Y 5 EMOCIONES QUE UD. EXPERIMENTE CON MAYOR INTENSIDAD"]
[null,"· MARQUE CON UNA X LAS EMOCIONES Y LOS NIVELES DE INTENSIDAD ESCOGIDOS"]
[null,"· MARQUE SUS PREFERENCIAS CON UN DOBLE CLIC EN LA CELDA ESCOGIDA (PUEDE BORRAR DEL MISMO MODO)"]
[]
[]
[null,"EMOCIONES \\ INTENSIDAD","NADA","POCO","MEDIANAMENTE","BASTANTE","MUCHO","VALORACIÓN"]
[null,null,1.00000000001,2,3,4,5]
[null,{"$f":"User01!B13","v":"ALEGRÍA"},null,null,null,null,null,{"$f":"IF((SUMIF(C13:G13,\"X\",$C$12:$G$12)),(SUMIF(C13:G13,\"X\",$C$12:$G$12)), 1)","v":1}]
[null,{"$f":"User01!B14","v":"SATISFACCIÓN"},null,null,null,null,null,{"$f":"IF((SUMIF(C14:G14,\"X\",$C$12:$G$12)),(SUMIF(C14:G14,\"X\",$C$12:$G$12)), 1)","v":1}]
[null,{"$f":"User01!B15","v":"FASCINACIÓN"},null,null,null,null,null,1]
[null,{"$f":"User01!B16","v":"ABURRIMIENTO"},null,null,null,null,null,1]
[null,{"$f":"User01!B17","v":"ENFADO"},null,null,null,null,null,1]
[null,{"$f":"User01!B18","v":"TRISTEZA"},null,null,null,null,null,1]
[null,{"$f":"User01!B19","v":"VERGÜENZA"},null,null,null,null,null,1]
[null,{"$f":"User01!B20","v":"MIEDO"},null,null,null,null,null,1]
[null,{"$f":"User01!B21","v":"REPUGNANCIA"},null,null,null,null,null,1]
[null,{"$f":"User01!B22","v":"DESEO"},null,null,null,null,null,1]
[null,{"$f":"User01!B23","v":"ESPERANZA"},null,null,null,null,null,1]
[null,{"$f":"User01!B24","v":"ORGULLO"},null,null,null,null,null,1]
[]
[]
[]
[null,"EMOCIONES \\ INTENSIDAD","NADA","POCO","MEDIANAMENTE","BASTANTE","MUCHO","VALORACIÓN"]
[null,null,1.00000000001,2,3,4,5]
[null,{"$f":"$B13","v":"ALEGRÍA"},null,null,null,null,null,{"$f":"IF((SUMIF(C30:G30,\"X\",$C$29:$G$29)),(SUMIF(C30:G30,\"X\",$C$29:$G$29)), 1)","v":1}]
[null,"SATISFACCIÓN",null,null,null,null,null,{"$f":"IF((SUMIF(C31:G31,\"X\",$C$29:$G$29)),(SUMIF(C31:G31,\"X\",$C$29:$G$29)), 1)","v":1}]
[null,"FASCINACIÓN",null,null,null,null,null,1]
[null,"ABURRIMIENTO",null,null,null,null,null,1]
[null,"ENFADO",null,null,null,null,null,1]
[null,"TRISTEZA",null,null,null,null,null,1]
[null,"VERGÜENZA",null,null,null,null,null,1]
[null,"MIEDO",null,null,null,null,null,1]
[null,"REPUGNANCIA",null,null,null,null,null,1]
[null,"DESEO",null,null,null,null,null,1]
[null,"ESPERANZA",null,null,null,null,null,1]
[null,"ORGULLO",null,null,null,null,null,1]
[]
[]
[]
[null,"EMOCIONES \\ INTENSIDAD","NADA","POCO","MEDIANAMENTE","BASTANTE","MUCHO","VALORACIÓN"]
[null,null,1.00000000001,2,3,4,5]
[null,{"$f":"$B30","v":"ALEGRÍA"},null,null,null,null,null,{"$f":"IF((SUMIF(C47:G47,\"X\",$C$46:$G$46)),(SUMIF(C47:G47,\"X\",$C$46:$G$46)), 1)","v":1}]
[null,"SATISFACCIÓN",null,null,null,null,null,{"$f":"IF((SUMIF(C48:G48,\"X\",$C$46:$G$46)),(SUMIF(C48:G48,\"X\",$C$46:$G$46)), 1)","v":1}]
[null,"FASCINACIÓN",null,null,null,null,null,1]
[null,"ABURRIMIENTO",null,null,null,null,null,1]
[null,"ENFADO",null,null,null,null,null,1]
[null,"TRISTEZA",null,null,null,null,null,1]
[null,"VERGÜENZA",null,null,null,null,null,1]
[null,"MIEDO",null,null,null,null,null,1]
[null,"REPUGNANCIA",null,null,null,null,null,1]
[null,"DESEO",null,null,null,null,null,1]
[null,"ESPERANZA",null,null,null,null,null,1]
[null,"ORGULLO",null,null,null,null,null,1]
[]
[]
[]
[]
[null,"EMOCIONES \\ INTENSIDAD","NADA","POCO","MEDIANAMENTE","BASTANTE","MUCHO","VALORACIÓN"]
[null,null,1.00000000001,2,3,4,5]
[null,{"$f":"$B47","v":"ALEGRÍA"},null,null,null,null,null,{"$f":"IF((SUMIF(C65:G65,\"X\",$C$64:$G$64)),(SUMIF(C65:G65,\"X\",$C$64:$G$64)), 1)","v":1}]
[null,"SATISFACCIÓN",null,null,null,null,null,{"$f":"IF((SUMIF(C66:G66,\"X\",$C$64:$G$64)),(SUMIF(C66:G66,\"X\",$C$64:$G$64)), 1)","v":1}]
[null,"FASCINACIÓN",null,null,null,null,null,1]
[null,"ABURRIMIENTO",null,null,null,null,null,1]
[null,"ENFADO",null,null,null,null,null,1]
[null,"TRISTEZA",null,null,null,null,null,1]
[null,"VERGÜENZA",null,null,null,null,null,1]
[null,"MIEDO",null,null,null,null,null,1]
[null,"REPUGNANCIA",null,null,null,null,null,1]
[null,"DESEO",null,null,null,null,null,1]
[null,"ESPERANZA",null,null,null,null,null,1]
[null,"ORGULLO",null,null,null,null,null,1]
[]
[]
[]
[]
[null,"EMOCIONES \\ INTENSIDAD","NADA","POCO","MEDIANAMENTE","BASTANTE","MUCHO","VALORACIÓN"]
[null,null,1.00000000001,2,3,4,5]
[null,{"$f":"$B65","v":"ALEGRÍA"},null,null,null,null,null,{"$f":"IF((SUMIF(C83:G83,\"X\",$C$82:$G$82)),(SUMIF(C83:G83,\"X\",$C$82:$G$82)), 1)","v":1}]
[null,"SATISFACCIÓN",null,null,null,null,null,{"$f":"IF((SUMIF(C84:G84,\"X\",$C$82:$G$82)),(SUMIF(C84:G84,\"X\",$C$82:$G$82)), 1)","v":1}]
[null,"FASCINACIÓN",null,null,null,null,null,1]
[null,"ABURRIMIENTO",null,null,null,null,null,1]
[null,"ENFADO",null,null,null,null,null,1]
[null,"TRISTEZA",null,null,null,null,null,1]
[null,"VERGÜENZA",null,null,null,null,null,1]
[null,"MIEDO",null,null,null,null,null,1]
[null,"REPUGNANCIA",null,null,null,null,null,1]
[null,"DESEO",null,null,null,null,null,1]
[null,"ESPERANZA",null,null,null,null,null,1]
[null,"ORGULLO",null,null,null,null,null,1]
[]
[]
[]
[]
[null,"EMOCIONES \\ INTENSIDAD","NADA","POCO","MEDIANAMENTE","BASTANTE","MUCHO","VALORACIÓN"]
[null,null,1.00000000001,2,3,4,5]
[null,{"$f":"$B83","v":"ALEGRÍA"},null,null,null,null,null,{"$f":"IF((SUMIF(C101:G101,\"X\",$C$100:$G$100)),(SUMIF(C101:G101,\"X\",$C$100:$G$100)), 1)","v":1}]
[null,"SATISFACCIÓN",null,null,null,null,null,{"$f":"IF((SUMIF(C102:G102,\"X\",$C$100:$G$100)),(SUMIF(C102:G102,\"X\",$C$100:$G$100)), 1)","v":1}]
[null,"FASCINACIÓN",null,null,null,null,null,1]
[null,"ABURRIMIENTO",null,null,null,null,null,1]
[null,"ENFADO",null,null,null,null,null,1]
[null,"TRISTEZA",null,null,null,null,null,1]
[null,"VERGÜENZA",null,null,null,null,null,1]
[null,"MIEDO",null,null,null,null,null,1]
[null,"REPUGNANCIA",null,null,null,null,null,1]
[null,"DESEO",null,null,null,null,null,1]
[null,"ESPERANZA",null,null,null,null,null,1]
[null,"ORGULLO",null,null,null,null,null,1]

{"sheet":"User29","index":29,"n_rows":112,"n_cols":13,"rows_kept":112,"cut":false,"hidden":false,"merged":[[98,1,99,1],[98,7,99,7],[44,1,45,1],[44,7,45,7],[62,1,63,1],[62,7,63,7],[80,1,81,1],[80,7,81,7],[0,1,0,17],[2,13,5,17],[10,1,11,1],[10,7,11,7],[27,1,28,1],[27,7,28,7]]}
[null,"ESTAS TABLAS UTILIZAN MACROS DE EXCEL, POR LO TANTO CUANDO SE LE CONSULTE AL ABRIR EL ARCHIVO DEBE ACEPTAR Y HABILITAR LAS MACROS PARA QUE FUNCIONEN CORRECTAMENTE"]
[]
[null,"VALORACIÓN EMOCIONAL DE PRODUCTOS, MATERIALES O SERVICIOS",null,null,null,null,null,null,"GÉNERO:",null,"EDAD:",null,"OBS:"]
[]
[null,"DÍGANOS COMO SE SIENTE RESPECTO A CADA PRODUCTO, MATERIAL O SERVICIO"]
[null,"· ESCOJA ENTRE 3 Y 5 EMOCIONES QUE UD. EXPERIMENTE CON MAYOR INTENSIDAD"]
[null,"· MARQUE CON UNA X LAS EMOCIONES Y LOS NIVELES DE INTENSIDAD ESCOGIDOS"]
[null,"· MARQUE SUS PREFERENCIAS CON UN DOBLE CLIC EN LA CELDA ESCOGIDA (PUEDE BORRAR DEL MISMO MODO)"]
[]
[]
[null,"EMOCIONES \\ INTENSIDAD","NADA","POCO","MEDIANAMENTE","BASTANTE","MUCHO","VALORACIÓN"]
[null,null,1.00000000001,2,3,4,5]
[null,{"$f":"User01!B13","v":"ALEGRÍA"},null,null,null,null,null,{"$f":"IF((SUMIF(C13:G13,\"X\",$C$12:$G$12)),(SUMIF(C13:G13,\"X\",$C$12:$G$12)), 1)","v":1}]
[null,{"$f":"User01!B14","v":"SATISFACCIÓN"},null,null,null,null,null,{"$f":"IF((SUMIF(C14:G14,\"X\",$C$12:$G$12)),(SUMIF(C14:G14,\"X\",$C$12:$G$12)), 1)","v":1}]
[null,{"$f":"User01!B15","v":"FASCINACIÓN"},null,null,null,null,null,1]
[null,{"$f":"User01!B16","v":"ABURRIMIENTO"},null,null,null,null,null,1]
[null,{"$f":"User01!B17","v":"ENFADO"},null,null,null,null,null,1]
[null,{"$f":"User01!B18","v":"TRISTEZA"},null,null,null,null,null,1]
[null,{"$f":"User01!B19","v":"VERGÜENZA"},null,null,null,null,null,1]
[null,{"$f":"User01!B20","v":"MIEDO"},null,null,null,null,null,1]
[null,{"$f":"User01!B21","v":"REPUGNANCIA"},null,null,null,null,null,1]
[null,{"$f":"User01!B22","v":"DESEO"},null,null,null,null,null,1]
[null,{"$f":"User01!B23","v":"ESPERANZA"},null,null,null,null,null,1]
[null,{"$f":"User01!B24","v":"ORGULLO"},null,null,null,null,null,1]
[]
[]
[]
[null,"EMOCIONES \\ INTENSIDAD","NADA","POCO","MEDIANAMENTE","BASTANTE","MUCHO","VALORACIÓN"]
[null,null,1.00000000001,2,3,4,5]
[null,{"$f":"$B13","v":"ALEGRÍA"},null,null,null,null,null,{"$f":"IF((SUMIF(C30:G30,\"X\",$C$29:$G$29)),(SUMIF(C30:G30,\"X\",$C$29:$G$29)), 1)","v":1}]
[null,"SATISFACCIÓN",null,null,null,null,null,{"$f":"IF((SUMIF(C31:G31,\"X\",$C$29:$G$29)),(SUMIF(C31:G31,\"X\",$C$29:$G$29)), 1)","v":1}]
[null,"FASCINACIÓN",null,null,null,null,null,1]
[null,"ABURRIMIENTO",null,null,null,null,null,1]
[null,"ENFADO",null,null,null,null,null,1]
[null,"TRISTEZA",null,null,null,null,null,1]
[null,"VERGÜENZA",null,null,null,null,null,1]
[null,"MIEDO",null,null,null,null,null,1]
[null,"REPUGNANCIA",null,null,null,null,null,1]
[null,"DESEO",null,null,null,null,null,1]
[null,"ESPERANZA",null,null,null,null,null,1]
[null,"ORGULLO",null,null,null,null,null,1]
[]
[]
[]
[null,"EMOCIONES \\ INTENSIDAD","NADA","POCO","MEDIANAMENTE","BASTANTE","MUCHO","VALORACIÓN"]
[null,null,1.00000000001,2,3,4,5]
[null,{"$f":"$B30","v":"ALEGRÍA"},null,null,null,null,null,{"$f":"IF((SUMIF(C47:G47,\"X\",$C$46:$G$46)),(SUMIF(C47:G47,\"X\",$C$46:$G$46)), 1)","v":1}]
[null,"SATISFACCIÓN",null,null,null,null,null,{"$f":"IF((SUMIF(C48:G48,\"X\",$C$46:$G$46)),(SUMIF(C48:G48,\"X\",$C$46:$G$46)), 1)","v":1}]
[null,"FASCINACIÓN",null,null,null,null,null,1]
[null,"ABURRIMIENTO",null,null,null,null,null,1]
[null,"ENFADO",null,null,null,null,null,1]
[null,"TRISTEZA",null,null,null,null,null,1]
[null,"VERGÜENZA",null,null,null,null,null,1]
[null,"MIEDO",null,null,null,null,null,1]
[null,"REPUGNANCIA",null,null,null,null,null,1]
[null,"DESEO",null,null,null,null,null,1]
[null,"ESPERANZA",null,null,null,null,null,1]
[null,"ORGULLO",null,null,null,null,null,1]
[]
[]
[]
[]
[null,"EMOCIONES \\ INTENSIDAD","NADA","POCO","MEDIANAMENTE","BASTANTE","MUCHO","VALORACIÓN"]
[null,null,1.00000000001,2,3,4,5]
[null,{"$f":"$B47","v":"ALEGRÍA"},null,null,null,null,null,{"$f":"IF((SUMIF(C65:G65,\"X\",$C$64:$G$64)),(SUMIF(C65:G65,\"X\",$C$64:$G$64)), 1)","v":1}]
[null,"SATISFACCIÓN",null,null,null,null,null,{"$f":"IF((SUMIF(C66:G66,\"X\",$C$64:$G$64)),(SUMIF(C66:G66,\"X\",$C$64:$G$64)), 1)","v":1}]
[null,"FASCINACIÓN",null,null,null,null,null,1]
[null,"ABURRIMIENTO",null,null,null,null,null,1]
[null,"ENFADO",null,null,null,null,null,1]
[null,"TRISTEZA",null,null,null,null,null,1]
[null,"VERGÜENZA",null,null,null,null,null,1]
[null,"MIEDO",null,null,null,null,null,1]
[null,"REPUGNANCIA",null,null,null,null,null,1]
[null,"DESEO",null,null,null,null,null,1]
[null,"ESPERANZA",null,null,null,null,null,1]
[null,"ORGULLO",null,null,null,null,null,1]
[]
[]
[]
[]
[null,"EMOCIONES \\ INTENSIDAD","NADA","POCO","MEDIANAMENTE","BASTANTE","MUCHO","VALORACIÓN"]
[null,null,1.00000000001,2,3,4,5]
[null,{"$f":"$B65","v":"ALEGRÍA"},null,null,null,null,null,{"$f":"IF((SUMIF(C83:G83,\"X\",$C$82:$G$82)),(SUMIF(C83:G83,\"X\",$C$82:$G$82)), 1)","v":1}]
[null,"SATISFACCIÓN",null,null,null,null,null,{"$f":"IF((SUMIF(C84:G84,\"X\",$C$82:$G$82)),(SUMIF(C84:G84,\"X\",$C$82:$G$82)), 1)","v":1}]
[null,"FASCINACIÓN",null,null,null,null,null,1]
[null,"ABURRIMIENTO",null,null,null,null,null,1]
[null,"ENFADO",null,null,null,null,null,1]
[null,"TRISTEZA",null,null,null,null,null,1]
[null,"VERGÜENZA",null,null,null,null,null,1]
[null,"MIEDO",null,null,null,null,null,1]
[null,"REPUGNANCIA",null,null,null,null,null,1]
[null,"DESEO",null,null,null,null,null,1]
[null,"ESPERANZA",null,null,null,null,null,1]
[null,"ORGULLO",null,null,null,null,null,1]
[]
[]
[]
[]
[null,"EMOCIONES \\ INTENSIDAD","NADA","POCO","MEDIANAMENTE","BASTANTE","MUCHO","VALORACIÓN"]
[null,null,1.00000000001,2,3,4,5]
[null,{"$f":"$B83","v":"ALEGRÍA"},null,null,null,null,null,{"$f":"IF((SUMIF(C101:G101,\"X\",$C$100:$G$100)),(SUMIF(C101:G101,\"X\",$C$100:$G$100)), 1)","v":1}]
[null,"SATISFACCIÓN",null,null,null,null,null,{"$f":"IF((SUMIF(C102:G102,\"X\",$C$100:$G$100)),(SUMIF(C102:G102,\"X\",$C$100:$G$100)), 1)","v":1}]
[null,"FASCINACIÓN",null,null,null,null,null,1]
[null,"ABURRIMIENTO",null,null,null,null,null,1]
[null,"ENFADO",null,null,null,null,null,1]
[null,"TRISTEZA",null,null,null,null,null,1]
[null,"VERGÜENZA",null,null,null,null,null,1]
[null,"MIEDO",null,null,null,null,null,1]
[null,"REPUGNANCIA",null,null,null,null,null,1]
[null,"DESEO",null,null,null,null,null,1]
[null,"ESPERANZA",null,null,null,null,null,1]
[null,"ORGULLO",null,null,null,null,null,1]

{"sheet":"User30","index":30,"n_rows":112,"n_cols":13,"rows_kept":112,"cut":false,"hidden":false,"merged":[[98,1,99,1],[98,7,99,7],[44,1,45,1],[44,7,45,7],[62,1,63,1],[62,7,63,7],[80,1,81,1],[80,7,81,7],[0,1,0,17],[2,13,5,17],[10,1,11,1],[10,7,11,7],[27,1,28,1],[27,7,28,7]]}
[null,"ESTAS TABLAS UTILIZAN MACROS DE EXCEL, POR LO TANTO CUANDO SE LE CONSULTE AL ABRIR EL ARCHIVO DEBE ACEPTAR Y HABILITAR LAS MACROS PARA QUE FUNCIONEN CORRECTAMENTE"]
[]
[null,"VALORACIÓN EMOCIONAL DE PRODUCTOS, MATERIALES O SERVICIOS",null,null,null,null,null,null,"GÉNERO:",null,"EDAD:",null,"OBS:"]
[]
[null,"DÍGANOS COMO SE SIENTE RESPECTO A CADA PRODUCTO, MATERIAL O SERVICIO"]
[null,"· ESCOJA ENTRE 3 Y 5 EMOCIONES QUE UD. EXPERIMENTE CON MAYOR INTENSIDAD"]
[null,"· MARQUE CON UNA X LAS EMOCIONES Y LOS NIVELES DE INTENSIDAD ESCOGIDOS"]
[null,"· MARQUE SUS PREFERENCIAS CON UN DOBLE CLIC EN LA CELDA ESCOGIDA (PUEDE BORRAR DEL MISMO MODO)"]
[]
[]
[null,"EMOCIONES \\ INTENSIDAD","NADA","POCO","MEDIANAMENTE","BASTANTE","MUCHO","VALORACIÓN"]
[null,null,1.00000000001,2,3,4,5]
[null,{"$f":"User01!B13","v":"ALEGRÍA"},null,null,null,null,null,{"$f":"IF((SUMIF(C13:G13,\"X\",$C$12:$G$12)),(SUMIF(C13:G13,\"X\",$C$12:$G$12)), 1)","v":1}]
[null,{"$f":"User01!B14","v":"SATISFACCIÓN"},null,null,null,null,null,{"$f":"IF((SUMIF(C14:G14,\"X\",$C$12:$G$12)),(SUMIF(C14:G14,\"X\",$C$12:$G$12)), 1)","v":1}]
[null,{"$f":"User01!B15","v":"FASCINACIÓN"},null,null,null,null,null,1]
[null,{"$f":"User01!B16","v":"ABURRIMIENTO"},null,null,null,null,null,1]
[null,{"$f":"User01!B17","v":"ENFADO"},null,null,null,null,null,1]
[null,{"$f":"User01!B18","v":"TRISTEZA"},null,null,null,null,null,1]
[null,{"$f":"User01!B19","v":"VERGÜENZA"},null,null,null,null,null,1]
[null,{"$f":"User01!B20","v":"MIEDO"},null,null,null,null,null,1]
[null,{"$f":"User01!B21","v":"REPUGNANCIA"},null,null,null,null,null,1]
[null,{"$f":"User01!B22","v":"DESEO"},null,null,null,null,null,1]
[null,{"$f":"User01!B23","v":"ESPERANZA"},null,null,null,null,null,1]
[null,{"$f":"User01!B24","v":"ORGULLO"},null,null,null,null,null,1]
[]
[]
[]
[null,"EMOCIONES \\ INTENSIDAD","NADA","POCO","MEDIANAMENTE","BASTANTE","MUCHO","VALORACIÓN"]
[null,null,1.00000000001,2,3,4,5]
[null,{"$f":"$B13","v":"ALEGRÍA"},null,null,null,null,null,{"$f":"IF((SUMIF(C30:G30,\"X\",$C$29:$G$29)),(SUMIF(C30:G30,\"X\",$C$29:$G$29)), 1)","v":1}]
[null,"SATISFACCIÓN",null,null,null,null,null,{"$f":"IF((SUMIF(C31:G31,\"X\",$C$29:$G$29)),(SUMIF(C31:G31,\"X\",$C$29:$G$29)), 1)","v":1}]
[null,"FASCINACIÓN",null,null,null,null,null,1]
[null,"ABURRIMIENTO",null,null,null,null,null,1]
[null,"ENFADO",null,null,null,null,null,1]
[null,"TRISTEZA",null,null,null,null,null,1]
[null,"VERGÜENZA",null,null,null,null,null,1]
[null,"MIEDO",null,null,null,null,null,1]
[null,"REPUGNANCIA",null,null,null,null,null,1]
[null,"DESEO",null,null,null,null,null,1]
[null,"ESPERANZA",null,null,null,null,null,1]
[null,"ORGULLO",null,null,null,null,null,1]
[]
[]
[]
[null,"EMOCIONES \\ INTENSIDAD","NADA","POCO","MEDIANAMENTE","BASTANTE","MUCHO","VALORACIÓN"]
[null,null,1.00000000001,2,3,4,5]
[null,{"$f":"$B30","v":"ALEGRÍA"},null,null,null,null,null,{"$f":"IF((SUMIF(C47:G47,\"X\",$C$46:$G$46)),(SUMIF(C47:G47,\"X\",$C$46:$G$46)), 1)","v":1}]
[null,"SATISFACCIÓN",null,null,null,null,null,{"$f":"IF((SUMIF(C48:G48,\"X\",$C$46:$G$46)),(SUMIF(C48:G48,\"X\",$C$46:$G$46)), 1)","v":1}]
[null,"FASCINACIÓN",null,null,null,null,null,1]
[null,"ABURRIMIENTO",null,null,null,null,null,1]
[null,"ENFADO",null,null,null,null,null,1]
[null,"TRISTEZA",null,null,null,null,null,1]
[null,"VERGÜENZA",null,null,null,null,null,1]
[null,"MIEDO",null,null,null,null,null,1]
[null,"REPUGNANCIA",null,null,null,null,null,1]
[null,"DESEO",null,null,null,null,null,1]
[null,"ESPERANZA",null,null,null,null,null,1]
[null,"ORGULLO",null,null,null,null,null,1]
[]
[]
[]
[]
[null,"EMOCIONES \\ INTENSIDAD","NADA","POCO","MEDIANAMENTE","BASTANTE","MUCHO","VALORACIÓN"]
[null,null,1.00000000001,2,3,4,5]
[null,{"$f":"$B47","v":"ALEGRÍA"},null,null,null,null,null,{"$f":"IF((SUMIF(C65:G65,\"X\",$C$64:$G$64)),(SUMIF(C65:G65,\"X\",$C$64:$G$64)), 1)","v":1}]
[null,"SATISFACCIÓN",null,null,null,null,null,{"$f":"IF((SUMIF(C66:G66,\"X\",$C$64:$G$64)),(SUMIF(C66:G66,\"X\",$C$64:$G$64)), 1)","v":1}]
[null,"FASCINACIÓN",null,null,null,null,null,1]
[null,"ABURRIMIENTO",null,null,null,null,null,1]
[null,"ENFADO",null,null,null,null,null,1]
[null,"TRISTEZA",null,null,null,null,null,1]
[null,"VERGÜENZA",null,null,null,null,null,1]
[null,"MIEDO",null,null,null,null,null,1]
[null,"REPUGNANCIA",null,null,null,null,null,1]
[null,"DESEO",null,null,null,null,null,1]
[null,"ESPERANZA",null,null,null,null,null,1]
[null,"ORGULLO",null,null,null,null,null,1]
[]
[]
[]
[]
[null,"EMOCIONES \\ INTENSIDAD","NADA","POCO","MEDIANAMENTE","BASTANTE","MUCHO","VALORACIÓN"]
[null,null,1.00000000001,2,3,4,5]
[null,{"$f":"$B65","v":"ALEGRÍA"},null,null,null,null,null,{"$f":"IF((SUMIF(C83:G83,\"X\",$C$82:$G$82)),(SUMIF(C83:G83,\"X\",$C$82:$G$82)), 1)","v":1}]
[null,"SATISFACCIÓN",null,null,null,null,null,{"$f":"IF((SUMIF(C84:G84,\"X\",$C$82:$G$82)),(SUMIF(C84:G84,\"X\",$C$82:$G$82)), 1)","v":1}]
[null,"FASCINACIÓN",null,null,null,null,null,1]
[null,"ABURRIMIENTO",null,null,null,null,null,1]
[null,"ENFADO",null,null,null,null,null,1]
[null,"TRISTEZA",null,null,null,null,null,1]
[null,"VERGÜENZA",null,null,null,null,null,1]
[null,"MIEDO",null,null,null,null,null,1]
[null,"REPUGNANCIA",null,null,null,null,null,1]
[null,"DESEO",null,null,null,null,null,1]
[null,"ESPERANZA",null,null,null,null,null,1]
[null,"ORGULLO",null,null,null,null,null,1]
[]
[]
[]
[]
[null,"EMOCIONES \\ INTENSIDAD","NADA","POCO","MEDIANAMENTE","BASTANTE","MUCHO","VALORACIÓN"]
[null,null,1.00000000001,2,3,4,5]
[null,{"$f":"$B83","v":"ALEGRÍA"},null,null,null,null,null,{"$f":"IF((SUMIF(C101:G101,\"X\",$C$100:$G$100)),(SUMIF(C101:G101,\"X\",$C$100:$G$100)), 1)","v":1}]
[null,"SATISFACCIÓN",null,null,null,null,null,{"$f":"IF((SUMIF(C102:G102,\"X\",$C$100:$G$100)),(SUMIF(C102:G102,\"X\",$C$100:$G$100)), 1)","v":1}]
[null,"FASCINACIÓN",null,null,null,null,null,1]
[null,"ABURRIMIENTO",null,null,null,null,null,1]
[null,"ENFADO",null,null,null,null,null,1]
[null,"TRISTEZA",null,null,null,null,null,1]
[null,"VERGÜENZA",null,null,null,null,null,1]
[null,"MIEDO",null,null,null,null,null,1]
[null,"REPUGNANCIA",null,null,null,null,null,1]
[null,"DESEO",null,null,null,null,null,1]
[null,"ESPERANZA",null,null,null,null,null,1]
[null,"ORGULLO",null,null,null,null,null,1]

{"sheet":"User31","index":31,"n_rows":112,"n_cols":13,"rows_kept":112,"cut":false,"hidden":false,"merged":[[98,1,99,1],[98,7,99,7],[44,1,45,1],[44,7,45,7],[62,1,63,1],[62,7,63,7],[80,1,81,1],[80,7,81,7],[0,1,0,17],[2,13,5,17],[10,1,11,1],[10,7,11,7],[27,1,28,1],[27,7,28,7]]}
[null,"ESTAS TABLAS UTILIZAN MACROS DE EXCEL, POR LO TANTO CUANDO SE LE CONSULTE AL ABRIR EL ARCHIVO DEBE ACEPTAR Y HABILITAR LAS MACROS PARA QUE FUNCIONEN CORRECTAMENTE"]
[]
[null,"VALORACIÓN EMOCIONAL DE PRODUCTOS, MATERIALES O SERVICIOS",null,null,null,null,null,null,"GÉNERO:",null,"EDAD:",null,"OBS:"]
[]
[null,"DÍGANOS COMO SE SIENTE RESPECTO A CADA PRODUCTO, MATERIAL O SERVICIO"]
[null,"· ESCOJA ENTRE 3 Y 5 EMOCIONES QUE UD. EXPERIMENTE CON MAYOR INTENSIDAD"]
[null,"· MARQUE CON UNA X LAS EMOCIONES Y LOS NIVELES DE INTENSIDAD ESCOGIDOS"]
[null,"· MARQUE SUS PREFERENCIAS CON UN DOBLE CLIC EN LA CELDA ESCOGIDA (PUEDE BORRAR DEL MISMO MODO)"]
[]
[]
[null,"EMOCIONES \\ INTENSIDAD","NADA","POCO","MEDIANAMENTE","BASTANTE","MUCHO","VALORACIÓN"]
[null,null,1.00000000001,2,3,4,5]
[null,{"$f":"User01!B13","v":"ALEGRÍA"},null,null,null,null,null,{"$f":"IF((SUMIF(C13:G13,\"X\",$C$12:$G$12)),(SUMIF(C13:G13,\"X\",$C$12:$G$12)), 1)","v":1}]
[null,{"$f":"User01!B14","v":"SATISFACCIÓN"},null,null,null,null,null,{"$f":"IF((SUMIF(C14:G14,\"X\",$C$12:$G$12)),(SUMIF(C14:G14,\"X\",$C$12:$G$12)), 1)","v":1}]
[null,{"$f":"User01!B15","v":"FASCINACIÓN"},null,null,null,null,null,1]
[null,{"$f":"User01!B16","v":"ABURRIMIENTO"},null,null,null,null,null,1]
[null,{"$f":"User01!B17","v":"ENFADO"},null,null,null,null,null,1]
[null,{"$f":"User01!B18","v":"TRISTEZA"},null,null,null,null,null,1]
[null,{"$f":"User01!B19","v":"VERGÜENZA"},null,null,null,null,null,1]
[null,{"$f":"User01!B20","v":"MIEDO"},null,null,null,null,null,1]
[null,{"$f":"User01!B21","v":"REPUGNANCIA"},null,null,null,null,null,1]
[null,{"$f":"User01!B22","v":"DESEO"},null,null,null,null,null,1]
[null,{"$f":"User01!B23","v":"ESPERANZA"},null,null,null,null,null,1]
[null,{"$f":"User01!B24","v":"ORGULLO"},null,null,null,null,null,1]
[]
[]
[]
[null,"EMOCIONES \\ INTENSIDAD","NADA","POCO","MEDIANAMENTE","BASTANTE","MUCHO","VALORACIÓN"]
[null,null,1.00000000001,2,3,4,5]
[null,{"$f":"$B13","v":"ALEGRÍA"},null,null,null,null,null,{"$f":"IF((SUMIF(C30:G30,\"X\",$C$29:$G$29)),(SUMIF(C30:G30,\"X\",$C$29:$G$29)), 1)","v":1}]
[null,"SATISFACCIÓN",null,null,null,null,null,{"$f":"IF((SUMIF(C31:G31,\"X\",$C$29:$G$29)),(SUMIF(C31:G31,\"X\",$C$29:$G$29)), 1)","v":1}]
[null,"FASCINACIÓN",null,null,null,null,null,1]
[null,"ABURRIMIENTO",null,null,null,null,null,1]
[null,"ENFADO",null,null,null,null,null,1]
[null,"TRISTEZA",null,null,null,null,null,1]
[null,"VERGÜENZA",null,null,null,null,null,1]
[null,"MIEDO",null,null,null,null,null,1]
[null,"REPUGNANCIA",null,null,null,null,null,1]
[null,"DESEO",null,null,null,null,null,1]
[null,"ESPERANZA",null,null,null,null,null,1]
[null,"ORGULLO",null,null,null,null,null,1]
[]
[]
[]
[null,"EMOCIONES \\ INTENSIDAD","NADA","POCO","MEDIANAMENTE","BASTANTE","MUCHO","VALORACIÓN"]
[null,null,1.00000000001,2,3,4,5]
[null,{"$f":"$B30","v":"ALEGRÍA"},null,null,null,null,null,{"$f":"IF((SUMIF(C47:G47,\"X\",$C$46:$G$46)),(SUMIF(C47:G47,\"X\",$C$46:$G$46)), 1)","v":1}]
[null,"SATISFACCIÓN",null,null,null,null,null,{"$f":"IF((SUMIF(C48:G48,\"X\",$C$46:$G$46)),(SUMIF(C48:G48,\"X\",$C$46:$G$46)), 1)","v":1}]
[null,"FASCINACIÓN",null,null,null,null,null,1]
[null,"ABURRIMIENTO",null,null,null,null,null,1]
[null,"ENFADO",null,null,null,null,null,1]
[null,"TRISTEZA",null,null,null,null,null,1]
[null,"VERGÜENZA",null,null,null,null,null,1]
[null,"MIEDO",null,null,null,null,null,1]
[null,"REPUGNANCIA",null,null,null,null,null,1]
[null,"DESEO",null,null,null,null,null,1]
[null,"ESPERANZA",null,null,null,null,null,1]
[null,"ORGULLO",null,null,null,null,null,1]
[]
[]
[]
[]
[null,"EMOCIONES \\ INTENSIDAD","NADA","POCO","MEDIANAMENTE","BASTANTE","MUCHO","VALORACIÓN"]
[null,null,1.00000000001,2,3,4,5]
[null,{"$f":"$B47","v":"ALEGRÍA"},null,null,null,null,null,{"$f":"IF((SUMIF(C65:G65,\"X\",$C$64:$G$64)),(SUMIF(C65:G65,\"X\",$C$64:$G$64)), 1)","v":1}]
[null,"SATISFACCIÓN",null,null,null,null,null,{"$f":"IF((SUMIF(C66:G66,\"X\",$C$64:$G$64)),(SUMIF(C66:G66,\"X\",$C$64:$G$64)), 1)","v":1}]
[null,"FASCINACIÓN",null,null,null,null,null,1]
[null,"ABURRIMIENTO",null,null,null,null,null,1]
[null,"ENFADO",null,null,null,null,null,1]
[null,"TRISTEZA",null,null,null,null,null,1]
[null,"VERGÜENZA",null,null,null,null,null,1]
[null,"MIEDO",null,null,null,null,null,1]
[null,"REPUGNANCIA",null,null,null,null,null,1]
[null,"DESEO",null,null,null,null,null,1]
[null,"ESPERANZA",null,null,null,null,null,1]
[null,"ORGULLO",null,null,null,null,null,1]
[]
[]
[]
[]
[null,"EMOCIONES \\ INTENSIDAD","NADA","POCO","MEDIANAMENTE","BASTANTE","MUCHO","VALORACIÓN"]
[null,null,1.00000000001,2,3,4,5]
[null,{"$f":"$B65","v":"ALEGRÍA"},null,null,null,null,null,{"$f":"IF((SUMIF(C83:G83,\"X\",$C$82:$G$82)),(SUMIF(C83:G83,\"X\",$C$82:$G$82)), 1)","v":1}]
[null,"SATISFACCIÓN",null,null,null,null,null,{"$f":"IF((SUMIF(C84:G84,\"X\",$C$82:$G$82)),(SUMIF(C84:G84,\"X\",$C$82:$G$82)), 1)","v":1}]
[null,"FASCINACIÓN",null,null,null,null,null,1]
[null,"ABURRIMIENTO",null,null,null,null,null,1]
[null,"ENFADO",null,null,null,null,null,1]
[null,"TRISTEZA",null,null,null,null,null,1]
[null,"VERGÜENZA",null,null,null,null,null,1]
[null,"MIEDO",null,null,null,null,null,1]
[null,"REPUGNANCIA",null,null,null,null,null,1]
[null,"DESEO",null,null,null,null,null,1]
[null,"ESPERANZA",null,null,null,null,null,1]
[null,"ORGULLO",null,null,null,null,null,1]
[]
[]
[]
[]
[null,"EMOCIONES \\ INTENSIDAD","NADA","POCO","MEDIANAMENTE","BASTANTE","MUCHO","VALORACIÓN"]
[null,null,1.00000000001,2,3,4,5]
[null,{"$f":"$B83","v":"ALEGRÍA"},null,null,null,null,null,{"$f":"IF((SUMIF(C101:G101,\"X\",$C$100:$G$100)),(SUMIF(C101:G101,\"X\",$C$100:$G$100)), 1)","v":1}]
[null,"SATISFACCIÓN",null,null,null,null,null,{"$f":"IF((SUMIF(C102:G102,\"X\",$C$100:$G$100)),(SUMIF(C102:G102,\"X\",$C$100:$G$100)), 1)","v":1}]
[null,"FASCINACIÓN",null,null,null,null,null,1]
[null,"ABURRIMIENTO",null,null,null,null,null,1]
[null,"ENFADO",null,null,null,null,null,1]
[null,"TRISTEZA",null,null,null,null,null,1]
[null,"VERGÜENZA",null,null,null,null,null,1]
[null,"MIEDO",null,null,null,null,null,1]
[null,"REPUGNANCIA",null,null,null,null,null,1]
[null,"DESEO",null,null,null,null,null,1]
[null,"ESPERANZA",null,null,null,null,null,1]
[null,"ORGULLO",null,null,null,null,null,1]

{"sheet":"User32","index":32,"n_rows":112,"n_cols":13,"rows_kept":112,"cut":false,"hidden":false,"merged":[[98,1,99,1],[98,7,99,7],[44,1,45,1],[44,7,45,7],[62,1,63,1],[62,7,63,7],[80,1,81,1],[80,7,81,7],[0,1,0,17],[2,13,5,17],[10,1,11,1],[10,7,11,7],[27,1,28,1],[27,7,28,7]]}
[null,"ESTAS TABLAS UTILIZAN MACROS DE EXCEL, POR LO TANTO CUANDO SE LE CONSULTE AL ABRIR EL ARCHIVO DEBE ACEPTAR Y HABILITAR LAS MACROS PARA QUE FUNCIONEN CORRECTAMENTE"]
[]
[null,"VALORACIÓN EMOCIONAL DE PRODUCTOS, MATERIALES O SERVICIOS",null,null,null,null,null,null,"GÉNERO:",null,"EDAD:",null,"OBS:"]
[]
[null,"DÍGANOS COMO SE SIENTE RESPECTO A CADA PRODUCTO, MATERIAL O SERVICIO"]
[null,"· ESCOJA ENTRE 3 Y 5 EMOCIONES QUE UD. EXPERIMENTE CON MAYOR INTENSIDAD"]
[null,"· MARQUE CON UNA X LAS EMOCIONES Y LOS NIVELES DE INTENSIDAD ESCOGIDOS"]
[null,"· MARQUE SUS PREFERENCIAS CON UN DOBLE CLIC EN LA CELDA ESCOGIDA (PUEDE BORRAR DEL MISMO MODO)"]
[]
[]
[null,"EMOCIONES \\ INTENSIDAD","NADA","POCO","MEDIANAMENTE","BASTANTE","MUCHO","VALORACIÓN"]
[null,null,1.00000000001,2,3,4,5]
[null,{"$f":"User01!B13","v":"ALEGRÍA"},null,null,null,null,null,{"$f":"IF((SUMIF(C13:G13,\"X\",$C$12:$G$12)),(SUMIF(C13:G13,\"X\",$C$12:$G$12)), 1)","v":1}]
[null,{"$f":"User01!B14","v":"SATISFACCIÓN"},null,null,null,null,null,{"$f":"IF((SUMIF(C14:G14,\"X\",$C$12:$G$12)),(SUMIF(C14:G14,\"X\",$C$12:$G$12)), 1)","v":1}]
[null,{"$f":"User01!B15","v":"FASCINACIÓN"},null,null,null,null,null,1]
[null,{"$f":"User01!B16","v":"ABURRIMIENTO"},null,null,null,null,null,1]
[null,{"$f":"User01!B17","v":"ENFADO"},null,null,null,null,null,1]
[null,{"$f":"User01!B18","v":"TRISTEZA"},null,null,null,null,null,1]
[null,{"$f":"User01!B19","v":"VERGÜENZA"},null,null,null,null,null,1]
[null,{"$f":"User01!B20","v":"MIEDO"},null,null,null,null,null,1]
[null,{"$f":"User01!B21","v":"REPUGNANCIA"},null,null,null,null,null,1]
[null,{"$f":"User01!B22","v":"DESEO"},null,null,null,null,null,1]
[null,{"$f":"User01!B23","v":"ESPERANZA"},null,null,null,null,null,1]
[null,{"$f":"User01!B24","v":"ORGULLO"},null,null,null,null,null,1]
[]
[]
[]
[null,"EMOCIONES \\ INTENSIDAD","NADA","POCO","MEDIANAMENTE","BASTANTE","MUCHO","VALORACIÓN"]
[null,null,1.00000000001,2,3,4,5]
[null,{"$f":"$B13","v":"ALEGRÍA"},null,null,null,null,null,{"$f":"IF((SUMIF(C30:G30,\"X\",$C$29:$G$29)),(SUMIF(C30:G30,\"X\",$C$29:$G$29)), 1)","v":1}]
[null,"SATISFACCIÓN",null,null,null,null,null,{"$f":"IF((SUMIF(C31:G31,\"X\",$C$29:$G$29)),(SUMIF(C31:G31,\"X\",$C$29:$G$29)), 1)","v":1}]
[null,"FASCINACIÓN",null,null,null,null,null,1]
[null,"ABURRIMIENTO",null,null,null,null,null,1]
[null,"ENFADO",null,null,null,null,null,1]
[null,"TRISTEZA",null,null,null,null,null,1]
[null,"VERGÜENZA",null,null,null,null,null,1]
[null,"MIEDO",null,null,null,null,null,1]
[null,"REPUGNANCIA",null,null,null,null,null,1]
[null,"DESEO",null,null,null,null,null,1]
[null,"ESPERANZA",null,null,null,null,null,1]
[null,"ORGULLO",null,null,null,null,null,1]
[]
[]
[]
[null,"EMOCIONES \\ INTENSIDAD","NADA","POCO","MEDIANAMENTE","BASTANTE","MUCHO","VALORACIÓN"]
[null,null,1.00000000001,2,3,4,5]
[null,{"$f":"$B30","v":"ALEGRÍA"},null,null,null,null,null,{"$f":"IF((SUMIF(C47:G47,\"X\",$C$46:$G$46)),(SUMIF(C47:G47,\"X\",$C$46:$G$46)), 1)","v":1}]
[null,"SATISFACCIÓN",null,null,null,null,null,{"$f":"IF((SUMIF(C48:G48,\"X\",$C$46:$G$46)),(SUMIF(C48:G48,\"X\",$C$46:$G$46)), 1)","v":1}]
[null,"FASCINACIÓN",null,null,null,null,null,1]
[null,"ABURRIMIENTO",null,null,null,null,null,1]
[null,"ENFADO",null,null,null,null,null,1]
[null,"TRISTEZA",null,null,null,null,null,1]
[null,"VERGÜENZA",null,null,null,null,null,1]
[null,"MIEDO",null,null,null,null,null,1]
[null,"REPUGNANCIA",null,null,null,null,null,1]
[null,"DESEO",null,null,null,null,null,1]
[null,"ESPERANZA",null,null,null,null,null,1]
[null,"ORGULLO",null,null,null,null,null,1]
[]
[]
[]
[]
[null,"EMOCIONES \\ INTENSIDAD","NADA","POCO","MEDIANAMENTE","BASTANTE","MUCHO","VALORACIÓN"]
[null,null,1.00000000001,2,3,4,5]
[null,{"$f":"$B47","v":"ALEGRÍA"},null,null,null,null,null,{"$f":"IF((SUMIF(C65:G65,\"X\",$C$64:$G$64)),(SUMIF(C65:G65,\"X\",$C$64:$G$64)), 1)","v":1}]
[null,"SATISFACCIÓN",null,null,null,null,null,{"$f":"IF((SUMIF(C66:G66,\"X\",$C$64:$G$64)),(SUMIF(C66:G66,\"X\",$C$64:$G$64)), 1)","v":1}]
[null,"FASCINACIÓN",null,null,null,null,null,1]
[null,"ABURRIMIENTO",null,null,null,null,null,1]
[null,"ENFADO",null,null,null,null,null,1]
[null,"TRISTEZA",null,null,null,null,null,1]
[null,"VERGÜENZA",null,null,null,null,null,1]
[null,"MIEDO",null,null,null,null,null,1]
[null,"REPUGNANCIA",null,null,null,null,null,1]
[null,"DESEO",null,null,null,null,null,1]
[null,"ESPERANZA",null,null,null,null,null,1]
[null,"ORGULLO",null,null,null,null,null,1]
[]
[]
[]
[]
[null,"EMOCIONES \\ INTENSIDAD","NADA","POCO","MEDIANAMENTE","BASTANTE","MUCHO","VALORACIÓN"]
[null,null,1.00000000001,2,3,4,5]
[null,{"$f":"$B65","v":"ALEGRÍA"},null,null,null,null,null,{"$f":"IF((SUMIF(C83:G83,\"X\",$C$82:$G$82)),(SUMIF(C83:G83,\"X\",$C$82:$G$82)), 1)","v":1}]
[null,"SATISFACCIÓN",null,null,null,null,null,{"$f":"IF((SUMIF(C84:G84,\"X\",$C$82:$G$82)),(SUMIF(C84:G84,\"X\",$C$82:$G$82)), 1)","v":1}]
[null,"FASCINACIÓN",null,null,null,null,null,1]
[null,"ABURRIMIENTO",null,null,null,null,null,1]
[null,"ENFADO",null,null,null,null,null,1]
[null,"TRISTEZA",null,null,null,null,null,1]
[null,"VERGÜENZA",null,null,null,null,null,1]
[null,"MIEDO",null,null,null,null,null,1]
[null,"REPUGNANCIA",null,null,null,null,null,1]
[null,"DESEO",null,null,null,null,null,1]
[null,"ESPERANZA",null,null,null,null,null,1]
[null,"ORGULLO",null,null,null,null,null,1]
[]
[]
[]
[]
[null,"EMOCIONES \\ INTENSIDAD","NADA","POCO","MEDIANAMENTE","BASTANTE","MUCHO","VALORACIÓN"]
[null,null,1.00000000001,2,3,4,5]
[null,{"$f":"$B83","v":"ALEGRÍA"},null,null,null,null,null,{"$f":"IF((SUMIF(C101:G101,\"X\",$C$100:$G$100)),(SUMIF(C101:G101,\"X\",$C$100:$G$100)), 1)","v":1}]
[null,"SATISFACCIÓN",null,null,null,null,null,{"$f":"IF((SUMIF(C102:G102,\"X\",$C$100:$G$100)),(SUMIF(C102:G102,\"X\",$C$100:$G$100)), 1)","v":1}]
[null,"FASCINACIÓN",null,null,null,null,null,1]
[null,"ABURRIMIENTO",null,null,null,null,null,1]
[null,"ENFADO",null,null,null,null,null,1]
[null,"TRISTEZA",null,null,null,null,null,1]
[null,"VERGÜENZA",null,null,null,null,null,1]
[null,"MIEDO",null,null,null,null,null,1]
[null,"REPUGNANCIA",null,null,null,null,null,1]
[null,"DESEO",null,null,null,null,null,1]
[null,"ESPERANZA",null,null,null,null,null,1]
[null,"ORGULLO",null,null,null,null,null,1]

{"sheet":"User33","index":33,"n_rows":112,"n_cols":13,"rows_kept":112,"cut":false,"hidden":false,"merged":[[98,1,99,1],[98,7,99,7],[44,1,45,1],[44,7,45,7],[62,1,63,1],[62,7,63,7],[80,1,81,1],[80,7,81,7],[0,1,0,17],[2,13,5,17],[10,1,11,1],[10,7,11,7],[27,1,28,1],[27,7,28,7]]}
[null,"ESTAS TABLAS UTILIZAN MACROS DE EXCEL, POR LO TANTO CUANDO SE LE CONSULTE AL ABRIR EL ARCHIVO DEBE ACEPTAR Y HABILITAR LAS MACROS PARA QUE FUNCIONEN CORRECTAMENTE"]
[]
[null,"VALORACIÓN EMOCIONAL DE PRODUCTOS, MATERIALES O SERVICIOS",null,null,null,null,null,null,"GÉNERO:",null,"EDAD:",null,"OBS:"]
[]
[null,"DÍGANOS COMO SE SIENTE RESPECTO A CADA PRODUCTO, MATERIAL O SERVICIO"]
[null,"· ESCOJA ENTRE 3 Y 5 EMOCIONES QUE UD. EXPERIMENTE CON MAYOR INTENSIDAD"]
[null,"· MARQUE CON UNA X LAS EMOCIONES Y LOS NIVELES DE INTENSIDAD ESCOGIDOS"]
[null,"· MARQUE SUS PREFERENCIAS CON UN DOBLE CLIC EN LA CELDA ESCOGIDA (PUEDE BORRAR DEL MISMO MODO)"]
[]
[]
[null,"EMOCIONES \\ INTENSIDAD","NADA","POCO","MEDIANAMENTE","BASTANTE","MUCHO","VALORACIÓN"]
[null,null,1.00000000001,2,3,4,5]
[null,{"$f":"User01!B13","v":"ALEGRÍA"},null,null,null,null,null,{"$f":"IF((SUMIF(C13:G13,\"X\",$C$12:$G$12)),(SUMIF(C13:G13,\"X\",$C$12:$G$12)), 1)","v":1}]
[null,{"$f":"User01!B14","v":"SATISFACCIÓN"},null,null,null,null,null,{"$f":"IF((SUMIF(C14:G14,\"X\",$C$12:$G$12)),(SUMIF(C14:G14,\"X\",$C$12:$G$12)), 1)","v":1}]
[null,{"$f":"User01!B15","v":"FASCINACIÓN"},null,null,null,null,null,1]
[null,{"$f":"User01!B16","v":"ABURRIMIENTO"},null,null,null,null,null,1]
[null,{"$f":"User01!B17","v":"ENFADO"},null,null,null,null,null,1]
[null,{"$f":"User01!B18","v":"TRISTEZA"},null,null,null,null,null,1]
[null,{"$f":"User01!B19","v":"VERGÜENZA"},null,null,null,null,null,1]
[null,{"$f":"User01!B20","v":"MIEDO"},null,null,null,null,null,1]
[null,{"$f":"User01!B21","v":"REPUGNANCIA"},null,null,null,null,null,1]
[null,{"$f":"User01!B22","v":"DESEO"},null,null,null,null,null,1]
[null,{"$f":"User01!B23","v":"ESPERANZA"},null,null,null,null,null,1]
[null,{"$f":"User01!B24","v":"ORGULLO"},null,null,null,null,null,1]
[]
[]
[]
[null,"EMOCIONES \\ INTENSIDAD","NADA","POCO","MEDIANAMENTE","BASTANTE","MUCHO","VALORACIÓN"]
[null,null,1.00000000001,2,3,4,5]
[null,{"$f":"$B13","v":"ALEGRÍA"},null,null,null,null,null,{"$f":"IF((SUMIF(C30:G30,\"X\",$C$29:$G$29)),(SUMIF(C30:G30,\"X\",$C$29:$G$29)), 1)","v":1}]
[null,"SATISFACCIÓN",null,null,null,null,null,{"$f":"IF((SUMIF(C31:G31,\"X\",$C$29:$G$29)),(SUMIF(C31:G31,\"X\",$C$29:$G$29)), 1)","v":1}]
[null,"FASCINACIÓN",null,null,null,null,null,1]
[null,"ABURRIMIENTO",null,null,null,null,null,1]
[null,"ENFADO",null,null,null,null,null,1]
[null,"TRISTEZA",null,null,null,null,null,1]
[null,"VERGÜENZA",null,null,null,null,null,1]
[null,"MIEDO",null,null,null,null,null,1]
[null,"REPUGNANCIA",null,null,null,null,null,1]
[null,"DESEO",null,null,null,null,null,1]
[null,"ESPERANZA",null,null,null,null,null,1]
[null,"ORGULLO",null,null,null,null,null,1]
[]
[]
[]
[null,"EMOCIONES \\ INTENSIDAD","NADA","POCO","MEDIANAMENTE","BASTANTE","MUCHO","VALORACIÓN"]
[null,null,1.00000000001,2,3,4,5]
[null,{"$f":"$B30","v":"ALEGRÍA"},null,null,null,null,null,{"$f":"IF((SUMIF(C47:G47,\"X\",$C$46:$G$46)),(SUMIF(C47:G47,\"X\",$C$46:$G$46)), 1)","v":1}]
[null,"SATISFACCIÓN",null,null,null,null,null,{"$f":"IF((SUMIF(C48:G48,\"X\",$C$46:$G$46)),(SUMIF(C48:G48,\"X\",$C$46:$G$46)), 1)","v":1}]
[null,"FASCINACIÓN",null,null,null,null,null,1]
[null,"ABURRIMIENTO",null,null,null,null,null,1]
[null,"ENFADO",null,null,null,null,null,1]
[null,"TRISTEZA",null,null,null,null,null,1]
[null,"VERGÜENZA",null,null,null,null,null,1]
[null,"MIEDO",null,null,null,null,null,1]
[null,"REPUGNANCIA",null,null,null,null,null,1]
[null,"DESEO",null,null,null,null,null,1]
[null,"ESPERANZA",null,null,null,null,null,1]
[null,"ORGULLO",null,null,null,null,null,1]
[]
[]
[]
[]
[null,"EMOCIONES \\ INTENSIDAD","NADA","POCO","MEDIANAMENTE","BASTANTE","MUCHO","VALORACIÓN"]
[null,null,1.00000000001,2,3,4,5]
[null,{"$f":"$B47","v":"ALEGRÍA"},null,null,null,null,null,{"$f":"IF((SUMIF(C65:G65,\"X\",$C$64:$G$64)),(SUMIF(C65:G65,\"X\",$C$64:$G$64)), 1)","v":1}]
[null,"SATISFACCIÓN",null,null,null,null,null,{"$f":"IF((SUMIF(C66:G66,\"X\",$C$64:$G$64)),(SUMIF(C66:G66,\"X\",$C$64:$G$64)), 1)","v":1}]
[null,"FASCINACIÓN",null,null,null,null,null,1]
[null,"ABURRIMIENTO",null,null,null,null,null,1]
[null,"ENFADO",null,null,null,null,null,1]
[null,"TRISTEZA",null,null,null,null,null,1]
[null,"VERGÜENZA",null,null,null,null,null,1]
[null,"MIEDO",null,null,null,null,null,1]
[null,"REPUGNANCIA",null,null,null,null,null,1]
[null,"DESEO",null,null,null,null,null,1]
[null,"ESPERANZA",null,null,null,null,null,1]
[null,"ORGULLO",null,null,null,null,null,1]
[]
[]
[]
[]
[null,"EMOCIONES \\ INTENSIDAD","NADA","POCO","MEDIANAMENTE","BASTANTE","MUCHO","VALORACIÓN"]
[null,null,1.00000000001,2,3,4,5]
[null,{"$f":"$B65","v":"ALEGRÍA"},null,null,null,null,null,{"$f":"IF((SUMIF(C83:G83,\"X\",$C$82:$G$82)),(SUMIF(C83:G83,\"X\",$C$82:$G$82)), 1)","v":1}]
[null,"SATISFACCIÓN",null,null,null,null,null,{"$f":"IF((SUMIF(C84:G84,\"X\",$C$82:$G$82)),(SUMIF(C84:G84,\"X\",$C$82:$G$82)), 1)","v":1}]
[null,"FASCINACIÓN",null,null,null,null,null,1]
[null,"ABURRIMIENTO",null,null,null,null,null,1]
[null,"ENFADO",null,null,null,null,null,1]
[null,"TRISTEZA",null,null,null,null,null,1]
[null,"VERGÜENZA",null,null,null,null,null,1]
[null,"MIEDO",null,null,null,null,null,1]
[null,"REPUGNANCIA",null,null,null,null,null,1]
[null,"DESEO",null,null,null,null,null,1]
[null,"ESPERANZA",null,null,null,null,null,1]
[null,"ORGULLO",null,null,null,null,null,1]
[]
[]
[]
[]
[null,"EMOCIONES \\ INTENSIDAD","NADA","POCO","MEDIANAMENTE","BASTANTE","MUCHO","VALORACIÓN"]
[null,null,1.00000000001,2,3,4,5]
[null,{"$f":"$B83","v":"ALEGRÍA"},null,null,null,null,null,{"$f":"IF((SUMIF(C101:G101,\"X\",$C$100:$G$100)),(SUMIF(C101:G101,\"X\",$C$100:$G$100)), 1)","v":1}]
[null,"SATISFACCIÓN",null,null,null,null,null,{"$f":"IF((SUMIF(C102:G102,\"X\",$C$100:$G$100)),(SUMIF(C102:G102,\"X\",$C$100:$G$100)), 1)","v":1}]
[null,"FASCINACIÓN",null,null,null,null,null,1]
[null,"ABURRIMIENTO",null,null,null,null,null,1]
[null,"ENFADO",null,null,null,null,null,1]
[null,"TRISTEZA",null,null,null,null,null,1]
[null,"VERGÜENZA",null,null,null,null,null,1]
[null,"MIEDO",null,null,null,null,null,1]
[null,"REPUGNANCIA",null,null,null,null,null,1]
[null,"DESEO",null,null,null,null,null,1]
[null,"ESPERANZA",null,null,null,null,null,1]
[null,"ORGULLO",null,null,null,null,null,1]

{"sheet":"User34","index":34,"n_rows":112,"n_cols":13,"rows_kept":112,"cut":false,"hidden":false,"merged":[[98,1,99,1],[98,7,99,7],[44,1,45,1],[44,7,45,7],[62,1,63,1],[62,7,63,7],[80,1,81,1],[80,7,81,7],[0,1,0,17],[2,13,5,17],[10,1,11,1],[10,7,11,7],[27,1,28,1],[27,7,28,7]]}
[null,"ESTAS TABLAS UTILIZAN MACROS DE EXCEL, POR LO TANTO CUANDO SE LE CONSULTE AL ABRIR EL ARCHIVO DEBE ACEPTAR Y HABILITAR LAS MACROS PARA QUE FUNCIONEN CORRECTAMENTE"]
[]
[null,"VALORACIÓN EMOCIONAL DE PRODUCTOS, MATERIALES O SERVICIOS",null,null,null,null,null,null,"GÉNERO:",null,"EDAD:",null,"OBS:"]
[]
[null,"DÍGANOS COMO SE SIENTE RESPECTO A CADA PRODUCTO, MATERIAL O SERVICIO"]
[null,"· ESCOJA ENTRE 3 Y 5 EMOCIONES QUE UD. EXPERIMENTE CON MAYOR INTENSIDAD"]
[null,"· MARQUE CON UNA X LAS EMOCIONES Y LOS NIVELES DE INTENSIDAD ESCOGIDOS"]
[null,"· MARQUE SUS PREFERENCIAS CON UN DOBLE CLIC EN LA CELDA ESCOGIDA (PUEDE BORRAR DEL MISMO MODO)"]
[]
[]
[null,"EMOCIONES \\ INTENSIDAD","NADA","POCO","MEDIANAMENTE","BASTANTE","MUCHO","VALORACIÓN"]
[null,null,1.00000000001,2,3,4,5]
[null,{"$f":"User01!B13","v":"ALEGRÍA"},null,null,null,null,null,{"$f":"IF((SUMIF(C13:G13,\"X\",$C$12:$G$12)),(SUMIF(C13:G13,\"X\",$C$12:$G$12)), 1)","v":1}]
[null,{"$f":"User01!B14","v":"SATISFACCIÓN"},null,null,null,null,null,{"$f":"IF((SUMIF(C14:G14,\"X\",$C$12:$G$12)),(SUMIF(C14:G14,\"X\",$C$12:$G$12)), 1)","v":1}]
[null,{"$f":"User01!B15","v":"FASCINACIÓN"},null,null,null,null,null,1]
[null,{"$f":"User01!B16","v":"ABURRIMIENTO"},null,null,null,null,null,1]
[null,{"$f":"User01!B17","v":"ENFADO"},null,null,null,null,null,1]
[null,{"$f":"User01!B18","v":"TRISTEZA"},null,null,null,null,null,1]
[null,{"$f":"User01!B19","v":"VERGÜENZA"},null,null,null,null,null,1]
[null,{"$f":"User01!B20","v":"MIEDO"},null,null,null,null,null,1]
[null,{"$f":"User01!B21","v":"REPUGNANCIA"},null,null,null,null,null,1]
[null,{"$f":"User01!B22","v":"DESEO"},null,null,null,null,null,1]
[null,{"$f":"User01!B23","v":"ESPERANZA"},null,null,null,null,null,1]
[null,{"$f":"User01!B24","v":"ORGULLO"},null,null,null,null,null,1]
[]
[]
[]
[null,"EMOCIONES \\ INTENSIDAD","NADA","POCO","MEDIANAMENTE","BASTANTE","MUCHO","VALORACIÓN"]
[null,null,1.00000000001,2,3,4,5]
[null,{"$f":"$B13","v":"ALEGRÍA"},null,null,null,null,null,{"$f":"IF((SUMIF(C30:G30,\"X\",$C$29:$G$29)),(SUMIF(C30:G30,\"X\",$C$29:$G$29)), 1)","v":1}]
[null,"SATISFACCIÓN",null,null,null,null,null,{"$f":"IF((SUMIF(C31:G31,\"X\",$C$29:$G$29)),(SUMIF(C31:G31,\"X\",$C$29:$G$29)), 1)","v":1}]
[null,"FASCINACIÓN",null,null,null,null,null,1]
[null,"ABURRIMIENTO",null,null,null,null,null,1]
[null,"ENFADO",null,null,null,null,null,1]
[null,"TRISTEZA",null,null,null,null,null,1]
[null,"VERGÜENZA",null,null,null,null,null,1]
[null,"MIEDO",null,null,null,null,null,1]
[null,"REPUGNANCIA",null,null,null,null,null,1]
[null,"DESEO",null,null,null,null,null,1]
[null,"ESPERANZA",null,null,null,null,null,1]
[null,"ORGULLO",null,null,null,null,null,1]
[]
[]
[]
[null,"EMOCIONES \\ INTENSIDAD","NADA","POCO","MEDIANAMENTE","BASTANTE","MUCHO","VALORACIÓN"]
[null,null,1.00000000001,2,3,4,5]
[null,{"$f":"$B30","v":"ALEGRÍA"},null,null,null,null,null,{"$f":"IF((SUMIF(C47:G47,\"X\",$C$46:$G$46)),(SUMIF(C47:G47,\"X\",$C$46:$G$46)), 1)","v":1}]
[null,"SATISFACCIÓN",null,null,null,null,null,{"$f":"IF((SUMIF(C48:G48,\"X\",$C$46:$G$46)),(SUMIF(C48:G48,\"X\",$C$46:$G$46)), 1)","v":1}]
[null,"FASCINACIÓN",null,null,null,null,null,1]
[null,"ABURRIMIENTO",null,null,null,null,null,1]
[null,"ENFADO",null,null,null,null,null,1]
[null,"TRISTEZA",null,null,null,null,null,1]
[null,"VERGÜENZA",null,null,null,null,null,1]
[null,"MIEDO",null,null,null,null,null,1]
[null,"REPUGNANCIA",null,null,null,null,null,1]
[null,"DESEO",null,null,null,null,null,1]
[null,"ESPERANZA",null,null,null,null,null,1]
[null,"ORGULLO",null,null,null,null,null,1]
[]
[]
[]
[]
[null,"EMOCIONES \\ INTENSIDAD","NADA","POCO","MEDIANAMENTE","BASTANTE","MUCHO","VALORACIÓN"]
[null,null,1.00000000001,2,3,4,5]
[null,{"$f":"$B47","v":"ALEGRÍA"},null,null,null,null,null,{"$f":"IF((SUMIF(C65:G65,\"X\",$C$64:$G$64)),(SUMIF(C65:G65,\"X\",$C$64:$G$64)), 1)","v":1}]
[null,"SATISFACCIÓN",null,null,null,null,null,{"$f":"IF((SUMIF(C66:G66,\"X\",$C$64:$G$64)),(SUMIF(C66:G66,\"X\",$C$64:$G$64)), 1)","v":1}]
[null,"FASCINACIÓN",null,null,null,null,null,1]
[null,"ABURRIMIENTO",null,null,null,null,null,1]
[null,"ENFADO",null,null,null,null,null,1]
[null,"TRISTEZA",null,null,null,null,null,1]
[null,"VERGÜENZA",null,null,null,null,null,1]
[null,"MIEDO",null,null,null,null,null,1]
[null,"REPUGNANCIA",null,null,null,null,null,1]
[null,"DESEO",null,null,null,null,null,1]
[null,"ESPERANZA",null,null,null,null,null,1]
[null,"ORGULLO",null,null,null,null,null,1]
[]
[]
[]
[]
[null,"EMOCIONES \\ INTENSIDAD","NADA","POCO","MEDIANAMENTE","BASTANTE","MUCHO","VALORACIÓN"]
[null,null,1.00000000001,2,3,4,5]
[null,{"$f":"$B65","v":"ALEGRÍA"},null,null,null,null,null,{"$f":"IF((SUMIF(C83:G83,\"X\",$C$82:$G$82)),(SUMIF(C83:G83,\"X\",$C$82:$G$82)), 1)","v":1}]
[null,"SATISFACCIÓN",null,null,null,null,null,{"$f":"IF((SUMIF(C84:G84,\"X\",$C$82:$G$82)),(SUMIF(C84:G84,\"X\",$C$82:$G$82)), 1)","v":1}]
[null,"FASCINACIÓN",null,null,null,null,null,1]
[null,"ABURRIMIENTO",null,null,null,null,null,1]
[null,"ENFADO",null,null,null,null,null,1]
[null,"TRISTEZA",null,null,null,null,null,1]
[null,"VERGÜENZA",null,null,null,null,null,1]
[null,"MIEDO",null,null,null,null,null,1]
[null,"REPUGNANCIA",null,null,null,null,null,1]
[null,"DESEO",null,null,null,null,null,1]
[null,"ESPERANZA",null,null,null,null,null,1]
[null,"ORGULLO",null,null,null,null,null,1]
[]
[]
[]
[]
[null,"EMOCIONES \\ INTENSIDAD","NADA","POCO","MEDIANAMENTE","BASTANTE","MUCHO","VALORACIÓN"]
[null,null,1.00000000001,2,3,4,5]
[null,{"$f":"$B83","v":"ALEGRÍA"},null,null,null,null,null,{"$f":"IF((SUMIF(C101:G101,\"X\",$C$100:$G$100)),(SUMIF(C101:G101,\"X\",$C$100:$G$100)), 1)","v":1}]
[null,"SATISFACCIÓN",null,null,null,null,null,{"$f":"IF((SUMIF(C102:G102,\"X\",$C$100:$G$100)),(SUMIF(C102:G102,\"X\",$C$100:$G$100)), 1)","v":1}]
[null,"FASCINACIÓN",null,null,null,null,null,1]
[null,"ABURRIMIENTO",null,null,null,null,null,1]
[null,"ENFADO",null,null,null,null,null,1]
[null,"TRISTEZA",null,null,null,null,null,1]
[null,"VERGÜENZA",null,null,null,null,null,1]
[null,"MIEDO",null,null,null,null,null,1]
[null,"REPUGNANCIA",null,null,null,null,null,1]
[null,"DESEO",null,null,null,null,null,1]
[null,"ESPERANZA",null,null,null,null,null,1]
[null,"ORGULLO",null,null,null,null,null,1]

{"sheet":"User35","index":35,"n_rows":112,"n_cols":13,"rows_kept":112,"cut":false,"hidden":false,"merged":[[98,1,99,1],[98,7,99,7],[44,1,45,1],[44,7,45,7],[62,1,63,1],[62,7,63,7],[80,1,81,1],[80,7,81,7],[0,1,0,17],[2,13,5,17],[10,1,11,1],[10,7,11,7],[27,1,28,1],[27,7,28,7]]}
[null,"ESTAS TABLAS UTILIZAN MACROS DE EXCEL, POR LO TANTO CUANDO SE LE CONSULTE AL ABRIR EL ARCHIVO DEBE ACEPTAR Y HABILITAR LAS MACROS PARA QUE FUNCIONEN CORRECTAMENTE"]
[]
[null,"VALORACIÓN EMOCIONAL DE PRODUCTOS, MATERIALES O SERVICIOS",null,null,null,null,null,null,"GÉNERO:",null,"EDAD:",null,"OBS:"]
[]
[null,"DÍGANOS COMO SE SIENTE RESPECTO A CADA PRODUCTO, MATERIAL O SERVICIO"]
[null,"· ESCOJA ENTRE 3 Y 5 EMOCIONES QUE UD. EXPERIMENTE CON MAYOR INTENSIDAD"]
[null,"· MARQUE CON UNA X LAS EMOCIONES Y LOS NIVELES DE INTENSIDAD ESCOGIDOS"]
[null,"· MARQUE SUS PREFERENCIAS CON UN DOBLE CLIC EN LA CELDA ESCOGIDA (PUEDE BORRAR DEL MISMO MODO)"]
[]
[]
[null,"EMOCIONES \\ INTENSIDAD","NADA","POCO","MEDIANAMENTE","BASTANTE","MUCHO","VALORACIÓN"]
[null,null,1.00000000001,2,3,4,5]
[null,{"$f":"User01!B13","v":"ALEGRÍA"},null,null,null,null,null,{"$f":"IF((SUMIF(C13:G13,\"X\",$C$12:$G$12)),(SUMIF(C13:G13,\"X\",$C$12:$G$12)), 1)","v":1}]
[null,{"$f":"User01!B14","v":"SATISFACCIÓN"},null,null,null,null,null,{"$f":"IF((SUMIF(C14:G14,\"X\",$C$12:$G$12)),(SUMIF(C14:G14,\"X\",$C$12:$G$12)), 1)","v":1}]
[null,{"$f":"User01!B15","v":"FASCINACIÓN"},null,null,null,null,null,1]
[null,{"$f":"User01!B16","v":"ABURRIMIENTO"},null,null,null,null,null,1]
[null,{"$f":"User01!B17","v":"ENFADO"},null,null,null,null,null,1]
[null,{"$f":"User01!B18","v":"TRISTEZA"},null,null,null,null,null,1]
[null,{"$f":"User01!B19","v":"VERGÜENZA"},null,null,null,null,null,1]
[null,{"$f":"User01!B20","v":"MIEDO"},null,null,null,null,null,1]
[null,{"$f":"User01!B21","v":"REPUGNANCIA"},null,null,null,null,null,1]
[null,{"$f":"User01!B22","v":"DESEO"},null,null,null,null,null,1]
[null,{"$f":"User01!B23","v":"ESPERANZA"},null,null,null,null,null,1]
[null,{"$f":"User01!B24","v":"ORGULLO"},null,null,null,null,null,1]
[]
[]
[]
[null,"EMOCIONES \\ INTENSIDAD","NADA","POCO","MEDIANAMENTE","BASTANTE","MUCHO","VALORACIÓN"]
[null,null,1.00000000001,2,3,4,5]
[null,{"$f":"$B13","v":"ALEGRÍA"},null,null,null,null,null,{"$f":"IF((SUMIF(C30:G30,\"X\",$C$29:$G$29)),(SUMIF(C30:G30,\"X\",$C$29:$G$29)), 1)","v":1}]
[null,"SATISFACCIÓN",null,null,null,null,null,{"$f":"IF((SUMIF(C31:G31,\"X\",$C$29:$G$29)),(SUMIF(C31:G31,\"X\",$C$29:$G$29)), 1)","v":1}]
[null,"FASCINACIÓN",null,null,null,null,null,1]
[null,"ABURRIMIENTO",null,null,null,null,null,1]
[null,"ENFADO",null,null,null,null,null,1]
[null,"TRISTEZA",null,null,null,null,null,1]
[null,"VERGÜENZA",null,null,null,null,null,1]
[null,"MIEDO",null,null,null,null,null,1]
[null,"REPUGNANCIA",null,null,null,null,null,1]
[null,"DESEO",null,null,null,null,null,1]
[null,"ESPERANZA",null,null,null,null,null,1]
[null,"ORGULLO",null,null,null,null,null,1]
[]
[]
[]
[null,"EMOCIONES \\ INTENSIDAD","NADA","POCO","MEDIANAMENTE","BASTANTE","MUCHO","VALORACIÓN"]
[null,null,1.00000000001,2,3,4,5]
[null,{"$f":"$B30","v":"ALEGRÍA"},null,null,null,null,null,{"$f":"IF((SUMIF(C47:G47,\"X\",$C$46:$G$46)),(SUMIF(C47:G47,\"X\",$C$46:$G$46)), 1)","v":1}]
[null,"SATISFACCIÓN",null,null,null,null,null,{"$f":"IF((SUMIF(C48:G48,\"X\",$C$46:$G$46)),(SUMIF(C48:G48,\"X\",$C$46:$G$46)), 1)","v":1}]
[null,"FASCINACIÓN",null,null,null,null,null,1]
[null,"ABURRIMIENTO",null,null,null,null,null,1]
[null,"ENFADO",null,null,null,null,null,1]
[null,"TRISTEZA",null,null,null,null,null,1]
[null,"VERGÜENZA",null,null,null,null,null,1]
[null,"MIEDO",null,null,null,null,null,1]
[null,"REPUGNANCIA",null,null,null,null,null,1]
[null,"DESEO",null,null,null,null,null,1]
[null,"ESPERANZA",null,null,null,null,null,1]
[null,"ORGULLO",null,null,null,null,null,1]
[]
[]
[]
[]
[null,"EMOCIONES \\ INTENSIDAD","NADA","POCO","MEDIANAMENTE","BASTANTE","MUCHO","VALORACIÓN"]
[null,null,1.00000000001,2,3,4,5]
[null,{"$f":"$B47","v":"ALEGRÍA"},null,null,null,null,null,{"$f":"IF((SUMIF(C65:G65,\"X\",$C$64:$G$64)),(SUMIF(C65:G65,\"X\",$C$64:$G$64)), 1)","v":1}]
[null,"SATISFACCIÓN",null,null,null,null,null,{"$f":"IF((SUMIF(C66:G66,\"X\",$C$64:$G$64)),(SUMIF(C66:G66,\"X\",$C$64:$G$64)), 1)","v":1}]
[null,"FASCINACIÓN",null,null,null,null,null,1]
[null,"ABURRIMIENTO",null,null,null,null,null,1]
[null,"ENFADO",null,null,null,null,null,1]
[null,"TRISTEZA",null,null,null,null,null,1]
[null,"VERGÜENZA",null,null,null,null,null,1]
[null,"MIEDO",null,null,null,null,null,1]
[null,"REPUGNANCIA",null,null,null,null,null,1]
[null,"DESEO",null,null,null,null,null,1]
[null,"ESPERANZA",null,null,null,null,null,1]
[null,"ORGULLO",null,null,null,null,null,1]
[]
[]
[]
[]
[null,"EMOCIONES \\ INTENSIDAD","NADA","POCO","MEDIANAMENTE","BASTANTE","MUCHO","VALORACIÓN"]
[null,null,1.00000000001,2,3,4,5]
[null,{"$f":"$B65","v":"ALEGRÍA"},null,null,null,null,null,{"$f":"IF((SUMIF(C83:G83,\"X\",$C$82:$G$82)),(SUMIF(C83:G83,\"X\",$C$82:$G$82)), 1)","v":1}]
[null,"SATISFACCIÓN",null,null,null,null,null,{"$f":"IF((SUMIF(C84:G84,\"X\",$C$82:$G$82)),(SUMIF(C84:G84,\"X\",$C$82:$G$82)), 1)","v":1}]
[null,"FASCINACIÓN",null,null,null,null,null,1]
[null,"ABURRIMIENTO",null,null,null,null,null,1]
[null,"ENFADO",null,null,null,null,null,1]
[null,"TRISTEZA",null,null,null,null,null,1]
[null,"VERGÜENZA",null,null,null,null,null,1]
[null,"MIEDO",null,null,null,null,null,1]
[null,"REPUGNANCIA",null,null,null,null,null,1]
[null,"DESEO",null,null,null,null,null,1]
[null,"ESPERANZA",null,null,null,null,null,1]
[null,"ORGULLO",null,null,null,null,null,1]
[]
[]
[]
[]
[null,"EMOCIONES \\ INTENSIDAD","NADA","POCO","MEDIANAMENTE","BASTANTE","MUCHO","VALORACIÓN"]
[null,null,1.00000000001,2,3,4,5]
[null,{"$f":"$B83","v":"ALEGRÍA"},null,null,null,null,null,{"$f":"IF((SUMIF(C101:G101,\"X\",$C$100:$G$100)),(SUMIF(C101:G101,\"X\",$C$100:$G$100)), 1)","v":1}]
[null,"SATISFACCIÓN",null,null,null,null,null,{"$f":"IF((SUMIF(C102:G102,\"X\",$C$100:$G$100)),(SUMIF(C102:G102,\"X\",$C$100:$G$100)), 1)","v":1}]
[null,"FASCINACIÓN",null,null,null,null,null,1]
[null,"ABURRIMIENTO",null,null,null,null,null,1]
[null,"ENFADO",null,null,null,null,null,1]
[null,"TRISTEZA",null,null,null,null,null,1]
[null,"VERGÜENZA",null,null,null,null,null,1]
[null,"MIEDO",null,null,null,null,null,1]
[null,"REPUGNANCIA",null,null,null,null,null,1]
[null,"DESEO",null,null,null,null,null,1]
[null,"ESPERANZA",null,null,null,null,null,1]
[null,"ORGULLO",null,null,null,null,null,1]

{"sheet":"User36","index":36,"n_rows":112,"n_cols":13,"rows_kept":112,"cut":false,"hidden":false,"merged":[[98,1,99,1],[98,7,99,7],[44,1,45,1],[44,7,45,7],[62,1,63,1],[62,7,63,7],[80,1,81,1],[80,7,81,7],[0,1,0,17],[2,13,5,17],[10,1,11,1],[10,7,11,7],[27,1,28,1],[27,7,28,7]]}
[null,"ESTAS TABLAS UTILIZAN MACROS DE EXCEL, POR LO TANTO CUANDO SE LE CONSULTE AL ABRIR EL ARCHIVO DEBE ACEPTAR Y HABILITAR LAS MACROS PARA QUE FUNCIONEN CORRECTAMENTE"]
[]
[null,"VALORACIÓN EMOCIONAL DE PRODUCTOS, MATERIALES O SERVICIOS",null,null,null,null,null,null,"GÉNERO:",null,"EDAD:",null,"OBS:"]
[]
[null,"DÍGANOS COMO SE SIENTE RESPECTO A CADA PRODUCTO, MATERIAL O SERVICIO"]
[null,"· ESCOJA ENTRE 3 Y 5 EMOCIONES QUE UD. EXPERIMENTE CON MAYOR INTENSIDAD"]
[null,"· MARQUE CON UNA X LAS EMOCIONES Y LOS NIVELES DE INTENSIDAD ESCOGIDOS"]
[null,"· MARQUE SUS PREFERENCIAS CON UN DOBLE CLIC EN LA CELDA ESCOGIDA (PUEDE BORRAR DEL MISMO MODO)"]
[]
[]
[null,"EMOCIONES \\ INTENSIDAD","NADA","POCO","MEDIANAMENTE","BASTANTE","MUCHO","VALORACIÓN"]
[null,null,1.00000000001,2,3,4,5]
[null,{"$f":"User01!B13","v":"ALEGRÍA"},null,null,null,null,null,{"$f":"IF((SUMIF(C13:G13,\"X\",$C$12:$G$12)),(SUMIF(C13:G13,\"X\",$C$12:$G$12)), 1)","v":1}]
[null,{"$f":"User01!B14","v":"SATISFACCIÓN"},null,null,null,null,null,{"$f":"IF((SUMIF(C14:G14,\"X\",$C$12:$G$12)),(SUMIF(C14:G14,\"X\",$C$12:$G$12)), 1)","v":1}]
[null,{"$f":"User01!B15","v":"FASCINACIÓN"},null,null,null,null,null,1]
[null,{"$f":"User01!B16","v":"ABURRIMIENTO"},null,null,null,null,null,1]
[null,{"$f":"User01!B17","v":"ENFADO"},null,null,null,null,null,1]
[null,{"$f":"User01!B18","v":"TRISTEZA"},null,null,null,null,null,1]
[null,{"$f":"User01!B19","v":"VERGÜENZA"},null,null,null,null,null,1]
[null,{"$f":"User01!B20","v":"MIEDO"},null,null,null,null,null,1]
[null,{"$f":"User01!B21","v":"REPUGNANCIA"},null,null,null,null,null,1]
[null,{"$f":"User01!B22","v":"DESEO"},null,null,null,null,null,1]
[null,{"$f":"User01!B23","v":"ESPERANZA"},null,null,null,null,null,1]
[null,{"$f":"User01!B24","v":"ORGULLO"},null,null,null,null,null,1]
[]
[]
[]
[null,"EMOCIONES \\ INTENSIDAD","NADA","POCO","MEDIANAMENTE","BASTANTE","MUCHO","VALORACIÓN"]
[null,null,1.00000000001,2,3,4,5]
[null,{"$f":"$B13","v":"ALEGRÍA"},null,null,null,null,null,{"$f":"IF((SUMIF(C30:G30,\"X\",$C$29:$G$29)),(SUMIF(C30:G30,\"X\",$C$29:$G$29)), 1)","v":1}]
[null,"SATISFACCIÓN",null,null,null,null,null,{"$f":"IF((SUMIF(C31:G31,\"X\",$C$29:$G$29)),(SUMIF(C31:G31,\"X\",$C$29:$G$29)), 1)","v":1}]
[null,"FASCINACIÓN",null,null,null,null,null,1]
[null,"ABURRIMIENTO",null,null,null,null,null,1]
[null,"ENFADO",null,null,null,null,null,1]
[null,"TRISTEZA",null,null,null,null,null,1]
[null,"VERGÜENZA",null,null,null,null,null,1]
[null,"MIEDO",null,null,null,null,null,1]
[null,"REPUGNANCIA",null,null,null,null,null,1]
[null,"DESEO",null,null,null,null,null,1]
[null,"ESPERANZA",null,null,null,null,null,1]
[null,"ORGULLO",null,null,null,null,null,1]
[]
[]
[]
[null,"EMOCIONES \\ INTENSIDAD","NADA","POCO","MEDIANAMENTE","BASTANTE","MUCHO","VALORACIÓN"]
[null,null,1.00000000001,2,3,4,5]
[null,{"$f":"$B30","v":"ALEGRÍA"},null,null,null,null,null,{"$f":"IF((SUMIF(C47:G47,\"X\",$C$46:$G$46)),(SUMIF(C47:G47,\"X\",$C$46:$G$46)), 1)","v":1}]
[null,"SATISFACCIÓN",null,null,null,null,null,{"$f":"IF((SUMIF(C48:G48,\"X\",$C$46:$G$46)),(SUMIF(C48:G48,\"X\",$C$46:$G$46)), 1)","v":1}]
[null,"FASCINACIÓN",null,null,null,null,null,1]
[null,"ABURRIMIENTO",null,null,null,null,null,1]
[null,"ENFADO",null,null,null,null,null,1]
[null,"TRISTEZA",null,null,null,null,null,1]
[null,"VERGÜENZA",null,null,null,null,null,1]
[null,"MIEDO",null,null,null,null,null,1]
[null,"REPUGNANCIA",null,null,null,null,null,1]
[null,"DESEO",null,null,null,null,null,1]
[null,"ESPERANZA",null,null,null,null,null,1]
[null,"ORGULLO",null,null,null,null,null,1]
[]
[]
[]
[]
[null,"EMOCIONES \\ INTENSIDAD","NADA","POCO","MEDIANAMENTE","BASTANTE","MUCHO","VALORACIÓN"]
[null,null,1.00000000001,2,3,4,5]
[null,{"$f":"$B47","v":"ALEGRÍA"},null,null,null,null,null,{"$f":"IF((SUMIF(C65:G65,\"X\",$C$64:$G$64)),(SUMIF(C65:G65,\"X\",$C$64:$G$64)), 1)","v":1}]
[null,"SATISFACCIÓN",null,null,null,null,null,{"$f":"IF((SUMIF(C66:G66,\"X\",$C$64:$G$64)),(SUMIF(C66:G66,\"X\",$C$64:$G$64)), 1)","v":1}]
[null,"FASCINACIÓN",null,null,null,null,null,1]
[null,"ABURRIMIENTO",null,null,null,null,null,1]
[null,"ENFADO",null,null,null,null,null,1]
[null,"TRISTEZA",null,null,null,null,null,1]
[null,"VERGÜENZA",null,null,null,null,null,1]
[null,"MIEDO",null,null,null,null,null,1]
[null,"REPUGNANCIA",null,null,null,null,null,1]
[null,"DESEO",null,null,null,null,null,1]
[null,"ESPERANZA",null,null,null,null,null,1]
[null,"ORGULLO",null,null,null,null,null,1]
[]
[]
[]
[]
[null,"EMOCIONES \\ INTENSIDAD","NADA","POCO","MEDIANAMENTE","BASTANTE","MUCHO","VALORACIÓN"]
[null,null,1.00000000001,2,3,4,5]
[null,{"$f":"$B65","v":"ALEGRÍA"},null,null,null,null,null,{"$f":"IF((SUMIF(C83:G83,\"X\",$C$82:$G$82)),(SUMIF(C83:G83,\"X\",$C$82:$G$82)), 1)","v":1}]
[null,"SATISFACCIÓN",null,null,null,null,null,{"$f":"IF((SUMIF(C84:G84,\"X\",$C$82:$G$82)),(SUMIF(C84:G84,\"X\",$C$82:$G$82)), 1)","v":1}]
[null,"FASCINACIÓN",null,null,null,null,null,1]
[null,"ABURRIMIENTO",null,null,null,null,null,1]
[null,"ENFADO",null,null,null,null,null,1]
[null,"TRISTEZA",null,null,null,null,null,1]
[null,"VERGÜENZA",null,null,null,null,null,1]
[null,"MIEDO",null,null,null,null,null,1]
[null,"REPUGNANCIA",null,null,null,null,null,1]
[null,"DESEO",null,null,null,null,null,1]
[null,"ESPERANZA",null,null,null,null,null,1]
[null,"ORGULLO",null,null,null,null,null,1]
[]
[]
[]
[]
[null,"EMOCIONES \\ INTENSIDAD","NADA","POCO","MEDIANAMENTE","BASTANTE","MUCHO","VALORACIÓN"]
[null,null,1.00000000001,2,3,4,5]
[null,{"$f":"$B83","v":"ALEGRÍA"},null,null,null,null,null,{"$f":"IF((SUMIF(C101:G101,\"X\",$C$100:$G$100)),(SUMIF(C101:G101,\"X\",$C$100:$G$100)), 1)","v":1}]
[null,"SATISFACCIÓN",null,null,null,null,null,{"$f":"IF((SUMIF(C102:G102,\"X\",$C$100:$G$100)),(SUMIF(C102:G102,\"X\",$C$100:$G$100)), 1)","v":1}]
[null,"FASCINACIÓN",null,null,null,null,null,1]
[null,"ABURRIMIENTO",null,null,null,null,null,1]
[null,"ENFADO",null,null,null,null,null,1]
[null,"TRISTEZA",null,null,null,null,null,1]
[null,"VERGÜENZA",null,null,null,null,null,1]
[null,"MIEDO",null,null,null,null,null,1]
[null,"REPUGNANCIA",null,null,null,null,null,1]
[null,"DESEO",null,null,null,null,null,1]
[null,"ESPERANZA",null,null,null,null,null,1]
[null,"ORGULLO",null,null,null,null,null,1]

{"sheet":"User37","index":37,"n_rows":112,"n_cols":13,"rows_kept":112,"cut":false,"hidden":false,"merged":[[98,1,99,1],[98,7,99,7],[44,1,45,1],[44,7,45,7],[62,1,63,1],[62,7,63,7],[80,1,81,1],[80,7,81,7],[0,1,0,17],[2,13,5,17],[10,1,11,1],[10,7,11,7],[27,1,28,1],[27,7,28,7]]}
[null,"ESTAS TABLAS UTILIZAN MACROS DE EXCEL, POR LO TANTO CUANDO SE LE CONSULTE AL ABRIR EL ARCHIVO DEBE ACEPTAR Y HABILITAR LAS MACROS PARA QUE FUNCIONEN CORRECTAMENTE"]
[]
[null,"VALORACIÓN EMOCIONAL DE PRODUCTOS, MATERIALES O SERVICIOS",null,null,null,null,null,null,"GÉNERO:",null,"EDAD:",null,"OBS:"]
[]
[null,"DÍGANOS COMO SE SIENTE RESPECTO A CADA PRODUCTO, MATERIAL O SERVICIO"]
[null,"· ESCOJA ENTRE 3 Y 5 EMOCIONES QUE UD. EXPERIMENTE CON MAYOR INTENSIDAD"]
[null,"· MARQUE CON UNA X LAS EMOCIONES Y LOS NIVELES DE INTENSIDAD ESCOGIDOS"]
[null,"· MARQUE SUS PREFERENCIAS CON UN DOBLE CLIC EN LA CELDA ESCOGIDA (PUEDE BORRAR DEL MISMO MODO)"]
[]
[]
[null,"EMOCIONES \\ INTENSIDAD","NADA","POCO","MEDIANAMENTE","BASTANTE","MUCHO","VALORACIÓN"]
[null,null,1.00000000001,2,3,4,5]
[null,{"$f":"User01!B13","v":"ALEGRÍA"},null,null,null,null,null,{"$f":"IF((SUMIF(C13:G13,\"X\",$C$12:$G$12)),(SUMIF(C13:G13,\"X\",$C$12:$G$12)), 1)","v":1}]
[null,{"$f":"User01!B14","v":"SATISFACCIÓN"},null,null,null,null,null,{"$f":"IF((SUMIF(C14:G14,\"X\",$C$12:$G$12)),(SUMIF(C14:G14,\"X\",$C$12:$G$12)), 1)","v":1}]
[null,{"$f":"User01!B15","v":"FASCINACIÓN"},null,null,null,null,null,1]
[null,{"$f":"User01!B16","v":"ABURRIMIENTO"},null,null,null,null,null,1]
[null,{"$f":"User01!B17","v":"ENFADO"},null,null,null,null,null,1]
[null,{"$f":"User01!B18","v":"TRISTEZA"},null,null,null,null,null,1]
[null,{"$f":"User01!B19","v":"VERGÜENZA"},null,null,null,null,null,1]
[null,{"$f":"User01!B20","v":"MIEDO"},null,null,null,null,null,1]
[null,{"$f":"User01!B21","v":"REPUGNANCIA"},null,null,null,null,null,1]
[null,{"$f":"User01!B22","v":"DESEO"},null,null,null,null,null,1]
[null,{"$f":"User01!B23","v":"ESPERANZA"},null,null,null,null,null,1]
[null,{"$f":"User01!B24","v":"ORGULLO"},null,null,null,null,null,1]
[]
[]
[]
[null,"EMOCIONES \\ INTENSIDAD","NADA","POCO","MEDIANAMENTE","BASTANTE","MUCHO","VALORACIÓN"]
[null,null,1.00000000001,2,3,4,5]
[null,{"$f":"$B13","v":"ALEGRÍA"},null,null,null,null,null,{"$f":"IF((SUMIF(C30:G30,\"X\",$C$29:$G$29)),(SUMIF(C30:G30,\"X\",$C$29:$G$29)), 1)","v":1}]
[null,"SATISFACCIÓN",null,null,null,null,null,{"$f":"IF((SUMIF(C31:G31,\"X\",$C$29:$G$29)),(SUMIF(C31:G31,\"X\",$C$29:$G$29)), 1)","v":1}]
[null,"FASCINACIÓN",null,null,null,null,null,1]
[null,"ABURRIMIENTO",null,null,null,null,null,1]
[null,"ENFADO",null,null,null,null,null,1]
[null,"TRISTEZA",null,null,null,null,null,1]
[null,"VERGÜENZA",null,null,null,null,null,1]
[null,"MIEDO",null,null,null,null,null,1]
[null,"REPUGNANCIA",null,null,null,null,null,1]
[null,"DESEO",null,null,null,null,null,1]
[null,"ESPERANZA",null,null,null,null,null,1]
[null,"ORGULLO",null,null,null,null,null,1]
[]
[]
[]
[null,"EMOCIONES \\ INTENSIDAD","NADA","POCO","MEDIANAMENTE","BASTANTE","MUCHO","VALORACIÓN"]
[null,null,1.00000000001,2,3,4,5]
[null,{"$f":"$B30","v":"ALEGRÍA"},null,null,null,null,null,{"$f":"IF((SUMIF(C47:G47,\"X\",$C$46:$G$46)),(SUMIF(C47:G47,\"X\",$C$46:$G$46)), 1)","v":1}]
[null,"SATISFACCIÓN",null,null,null,null,null,{"$f":"IF((SUMIF(C48:G48,\"X\",$C$46:$G$46)),(SUMIF(C48:G48,\"X\",$C$46:$G$46)), 1)","v":1}]
[null,"FASCINACIÓN",null,null,null,null,null,1]
[null,"ABURRIMIENTO",null,null,null,null,null,1]
[null,"ENFADO",null,null,null,null,null,1]
[null,"TRISTEZA",null,null,null,null,null,1]
[null,"VERGÜENZA",null,null,null,null,null,1]
[null,"MIEDO",null,null,null,null,null,1]
[null,"REPUGNANCIA",null,null,null,null,null,1]
[null,"DESEO",null,null,null,null,null,1]
[null,"ESPERANZA",null,null,null,null,null,1]
[null,"ORGULLO",null,null,null,null,null,1]
[]
[]
[]
[]
[null,"EMOCIONES \\ INTENSIDAD","NADA","POCO","MEDIANAMENTE","BASTANTE","MUCHO","VALORACIÓN"]
[null,null,1.00000000001,2,3,4,5]
[null,{"$f":"$B47","v":"ALEGRÍA"},null,null,null,null,null,{"$f":"IF((SUMIF(C65:G65,\"X\",$C$64:$G$64)),(SUMIF(C65:G65,\"X\",$C$64:$G$64)), 1)","v":1}]
[null,"SATISFACCIÓN",null,null,null,null,null,{"$f":"IF((SUMIF(C66:G66,\"X\",$C$64:$G$64)),(SUMIF(C66:G66,\"X\",$C$64:$G$64)), 1)","v":1}]
[null,"FASCINACIÓN",null,null,null,null,null,1]
[null,"ABURRIMIENTO",null,null,null,null,null,1]
[null,"ENFADO",null,null,null,null,null,1]
[null,"TRISTEZA",null,null,null,null,null,1]
[null,"VERGÜENZA",null,null,null,null,null,1]
[null,"MIEDO",null,null,null,null,null,1]
[null,"REPUGNANCIA",null,null,null,null,null,1]
[null,"DESEO",null,null,null,null,null,1]
[null,"ESPERANZA",null,null,null,null,null,1]
[null,"ORGULLO",null,null,null,null,null,1]
[]
[]
[]
[]
[null,"EMOCIONES \\ INTENSIDAD","NADA","POCO","MEDIANAMENTE","BASTANTE","MUCHO","VALORACIÓN"]
[null,null,1.00000000001,2,3,4,5]
[null,{"$f":"$B65","v":"ALEGRÍA"},null,null,null,null,null,{"$f":"IF((SUMIF(C83:G83,\"X\",$C$82:$G$82)),(SUMIF(C83:G83,\"X\",$C$82:$G$82)), 1)","v":1}]
[null,"SATISFACCIÓN",null,null,null,null,null,{"$f":"IF((SUMIF(C84:G84,\"X\",$C$82:$G$82)),(SUMIF(C84:G84,\"X\",$C$82:$G$82)), 1)","v":1}]
[null,"FASCINACIÓN",null,null,null,null,null,1]
[null,"ABURRIMIENTO",null,null,null,null,null,1]
[null,"ENFADO",null,null,null,null,null,1]
[null,"TRISTEZA",null,null,null,null,null,1]
[null,"VERGÜENZA",null,null,null,null,null,1]
[null,"MIEDO",null,null,null,null,null,1]
[null,"REPUGNANCIA",null,null,null,null,null,1]
[null,"DESEO",null,null,null,null,null,1]
[null,"ESPERANZA",null,null,null,null,null,1]
[null,"ORGULLO",null,null,null,null,null,1]
[]
[]
[]
[]
[null,"EMOCIONES \\ INTENSIDAD","NADA","POCO","MEDIANAMENTE","BASTANTE","MUCHO","VALORACIÓN"]
[null,null,1.00000000001,2,3,4,5]
[null,{"$f":"$B83","v":"ALEGRÍA"},null,null,null,null,null,{"$f":"IF((SUMIF(C101:G101,\"X\",$C$100:$G$100)),(SUMIF(C101:G101,\"X\",$C$100:$G$100)), 1)","v":1}]
[null,"SATISFACCIÓN",null,null,null,null,null,{"$f":"IF((SUMIF(C102:G102,\"X\",$C$100:$G$100)),(SUMIF(C102:G102,\"X\",$C$100:$G$100)), 1)","v":1}]
[null,"FASCINACIÓN",null,null,null,null,null,1]
[null,"ABURRIMIENTO",null,null,null,null,null,1]
[null,"ENFADO",null,null,null,null,null,1]
[null,"TRISTEZA",null,null,null,null,null,1]
[null,"VERGÜENZA",null,null,null,null,null,1]
[null,"MIEDO",null,null,null,null,null,1]
[null,"REPUGNANCIA",null,null,null,null,null,1]
[null,"DESEO",null,null,null,null,null,1]
[null,"ESPERANZA",null,null,null,null,null,1]
[null,"ORGULLO",null,null,null,null,null,1]

{"sheet":"User38","index":38,"n_rows":112,"n_cols":13,"rows_kept":112,"cut":false,"hidden":false,"merged":[[98,1,99,1],[98,7,99,7],[44,1,45,1],[44,7,45,7],[62,1,63,1],[62,7,63,7],[80,1,81,1],[80,7,81,7],[0,1,0,17],[2,13,5,17],[10,1,11,1],[10,7,11,7],[27,1,28,1],[27,7,28,7]]}
[null,"ESTAS TABLAS UTILIZAN MACROS DE EXCEL, POR LO TANTO CUANDO SE LE CONSULTE AL ABRIR EL ARCHIVO DEBE ACEPTAR Y HABILITAR LAS MACROS PARA QUE FUNCIONEN CORRECTAMENTE"]
[]
[null,"VALORACIÓN EMOCIONAL DE PRODUCTOS, MATERIALES O SERVICIOS",null,null,null,null,null,null,"GÉNERO:",null,"EDAD:",null,"OBS:"]
[]
[null,"DÍGANOS COMO SE SIENTE RESPECTO A CADA PRODUCTO, MATERIAL O SERVICIO"]
[null,"· ESCOJA ENTRE 3 Y 5 EMOCIONES QUE UD. EXPERIMENTE CON MAYOR INTENSIDAD"]
[null,"· MARQUE CON UNA X LAS EMOCIONES Y LOS NIVELES DE INTENSIDAD ESCOGIDOS"]
[null,"· MARQUE SUS PREFERENCIAS CON UN DOBLE CLIC EN LA CELDA ESCOGIDA (PUEDE BORRAR DEL MISMO MODO)"]
[]
[]
[null,"EMOCIONES \\ INTENSIDAD","NADA","POCO","MEDIANAMENTE","BASTANTE","MUCHO","VALORACIÓN"]
[null,null,1.00000000001,2,3,4,5]
[null,{"$f":"User01!B13","v":"ALEGRÍA"},null,null,null,null,null,{"$f":"IF((SUMIF(C13:G13,\"X\",$C$12:$G$12)),(SUMIF(C13:G13,\"X\",$C$12:$G$12)), 1)","v":1}]
[null,{"$f":"User01!B14","v":"SATISFACCIÓN"},null,null,null,null,null,{"$f":"IF((SUMIF(C14:G14,\"X\",$C$12:$G$12)),(SUMIF(C14:G14,\"X\",$C$12:$G$12)), 1)","v":1}]
[null,{"$f":"User01!B15","v":"FASCINACIÓN"},null,null,null,null,null,1]
[null,{"$f":"User01!B16","v":"ABURRIMIENTO"},null,null,null,null,null,1]
[null,{"$f":"User01!B17","v":"ENFADO"},null,null,null,null,null,1]
[null,{"$f":"User01!B18","v":"TRISTEZA"},null,null,null,null,null,1]
[null,{"$f":"User01!B19","v":"VERGÜENZA"},null,null,null,null,null,1]
[null,{"$f":"User01!B20","v":"MIEDO"},null,null,null,null,null,1]
[null,{"$f":"User01!B21","v":"REPUGNANCIA"},null,null,null,null,null,1]
[null,{"$f":"User01!B22","v":"DESEO"},null,null,null,null,null,1]
[null,{"$f":"User01!B23","v":"ESPERANZA"},null,null,null,null,null,1]
[null,{"$f":"User01!B24","v":"ORGULLO"},null,null,null,null,null,1]
[]
[]
[]
[null,"EMOCIONES \\ INTENSIDAD","NADA","POCO","MEDIANAMENTE","BASTANTE","MUCHO","VALORACIÓN"]
[null,null,1.00000000001,2,3,4,5]
[null,{"$f":"$B13","v":"ALEGRÍA"},null,null,null,null,null,{"$f":"IF((SUMIF(C30:G30,\"X\",$C$29:$G$29)),(SUMIF(C30:G30,\"X\",$C$29:$G$29)), 1)","v":1}]
[null,"SATISFACCIÓN",null,null,null,null,null,{"$f":"IF((SUMIF(C31:G31,\"X\",$C$29:$G$29)),(SUMIF(C31:G31,\"X\",$C$29:$G$29)), 1)","v":1}]
[null,"FASCINACIÓN",null,null,null,null,null,1]
[null,"ABURRIMIENTO",null,null,null,null,null,1]
[null,"ENFADO",null,null,null,null,null,1]
[null,"TRISTEZA",null,null,null,null,null,1]
[null,"VERGÜENZA",null,null,null,null,null,1]
[null,"MIEDO",null,null,null,null,null,1]
[null,"REPUGNANCIA",null,null,null,null,null,1]
[null,"DESEO",null,null,null,null,null,1]
[null,"ESPERANZA",null,null,null,null,null,1]
[null,"ORGULLO",null,null,null,null,null,1]
[]
[]
[]
[null,"EMOCIONES \\ INTENSIDAD","NADA","POCO","MEDIANAMENTE","BASTANTE","MUCHO","VALORACIÓN"]
[null,null,1.00000000001,2,3,4,5]
[null,{"$f":"$B30","v":"ALEGRÍA"},null,null,null,null,null,{"$f":"IF((SUMIF(C47:G47,\"X\",$C$46:$G$46)),(SUMIF(C47:G47,\"X\",$C$46:$G$46)), 1)","v":1}]
[null,"SATISFACCIÓN",null,null,null,null,null,{"$f":"IF((SUMIF(C48:G48,\"X\",$C$46:$G$46)),(SUMIF(C48:G48,\"X\",$C$46:$G$46)), 1)","v":1}]
[null,"FASCINACIÓN",null,null,null,null,null,1]
[null,"ABURRIMIENTO",null,null,null,null,null,1]
[null,"ENFADO",null,null,null,null,null,1]
[null,"TRISTEZA",null,null,null,null,null,1]
[null,"VERGÜENZA",null,null,null,null,null,1]
[null,"MIEDO",null,null,null,null,null,1]
[null,"REPUGNANCIA",null,null,null,null,null,1]
[null,"DESEO",null,null,null,null,null,1]
[null,"ESPERANZA",null,null,null,null,null,1]
[null,"ORGULLO",null,null,null,null,null,1]
[]
[]
[]
[]
[null,"EMOCIONES \\ INTENSIDAD","NADA","POCO","MEDIANAMENTE","BASTANTE","MUCHO","VALORACIÓN"]
[null,null,1.00000000001,2,3,4,5]
[null,{"$f":"$B47","v":"ALEGRÍA"},null,null,null,null,null,{"$f":"IF((SUMIF(C65:G65,\"X\",$C$64:$G$64)),(SUMIF(C65:G65,\"X\",$C$64:$G$64)), 1)","v":1}]
[null,"SATISFACCIÓN",null,null,null,null,null,{"$f":"IF((SUMIF(C66:G66,\"X\",$C$64:$G$64)),(SUMIF(C66:G66,\"X\",$C$64:$G$64)), 1)","v":1}]
[null,"FASCINACIÓN",null,null,null,null,null,1]
[null,"ABURRIMIENTO",null,null,null,null,null,1]
[null,"ENFADO",null,null,null,null,null,1]
[null,"TRISTEZA",null,null,null,null,null,1]
[null,"VERGÜENZA",null,null,null,null,null,1]
[null,"MIEDO",null,null,null,null,null,1]
[null,"REPUGNANCIA",null,null,null,null,null,1]
[null,"DESEO",null,null,null,null,null,1]
[null,"ESPERANZA",null,null,null,null,null,1]
[null,"ORGULLO",null,null,null,null,null,1]
[]
[]
[]
[]
[null,"EMOCIONES \\ INTENSIDAD","NADA","POCO","MEDIANAMENTE","BASTANTE","MUCHO","VALORACIÓN"]
[null,null,1.00000000001,2,3,4,5]
[null,{"$f":"$B65","v":"ALEGRÍA"},null,null,null,null,null,{"$f":"IF((SUMIF(C83:G83,\"X\",$C$82:$G$82)),(SUMIF(C83:G83,\"X\",$C$82:$G$82)), 1)","v":1}]
[null,"SATISFACCIÓN",null,null,null,null,null,{"$f":"IF((SUMIF(C84:G84,\"X\",$C$82:$G$82)),(SUMIF(C84:G84,\"X\",$C$82:$G$82)), 1)","v":1}]
[null,"FASCINACIÓN",null,null,null,null,null,1]
[null,"ABURRIMIENTO",null,null,null,null,null,1]
[null,"ENFADO",null,null,null,null,null,1]
[null,"TRISTEZA",null,null,null,null,null,1]
[null,"VERGÜENZA",null,null,null,null,null,1]
[null,"MIEDO",null,null,null,null,null,1]
[null,"REPUGNANCIA",null,null,null,null,null,1]
[null,"DESEO",null,null,null,null,null,1]
[null,"ESPERANZA",null,null,null,null,null,1]
[null,"ORGULLO",null,null,null,null,null,1]
[]
[]
[]
[]
[null,"EMOCIONES \\ INTENSIDAD","NADA","POCO","MEDIANAMENTE","BASTANTE","MUCHO","VALORACIÓN"]
[null,null,1.00000000001,2,3,4,5]
[null,{"$f":"$B83","v":"ALEGRÍA"},null,null,null,null,null,{"$f":"IF((SUMIF(C101:G101,\"X\",$C$100:$G$100)),(SUMIF(C101:G101,\"X\",$C$100:$G$100)), 1)","v":1}]
[null,"SATISFACCIÓN",null,null,null,null,null,{"$f":"IF((SUMIF(C102:G102,\"X\",$C$100:$G$100)),(SUMIF(C102:G102,\"X\",$C$100:$G$100)), 1)","v":1}]
[null,"FASCINACIÓN",null,null,null,null,null,1]
[null,"ABURRIMIENTO",null,null,null,null,null,1]
[null,"ENFADO",null,null,null,null,null,1]
[null,"TRISTEZA",null,null,null,null,null,1]
[null,"VERGÜENZA",null,null,null,null,null,1]
[null,"MIEDO",null,null,null,null,null,1]
[null,"REPUGNANCIA",null,null,null,null,null,1]
[null,"DESEO",null,null,null,null,null,1]
[null,"ESPERANZA",null,null,null,null,null,1]
[null,"ORGULLO",null,null,null,null,null,1]

{"sheet":"User39","index":39,"n_rows":112,"n_cols":13,"rows_kept":112,"cut":false,"hidden":false,"merged":[[98,1,99,1],[98,7,99,7],[44,1,45,1],[44,7,45,7],[62,1,63,1],[62,7,63,7],[80,1,81,1],[80,7,81,7],[0,1,0,17],[2,13,5,17],[10,1,11,1],[10,7,11,7],[27,1,28,1],[27,7,28,7]]}
[null,"ESTAS TABLAS UTILIZAN MACROS DE EXCEL, POR LO TANTO CUANDO SE LE CONSULTE AL ABRIR EL ARCHIVO DEBE ACEPTAR Y HABILITAR LAS MACROS PARA QUE FUNCIONEN CORRECTAMENTE"]
[]
[null,"VALORACIÓN EMOCIONAL DE PRODUCTOS, MATERIALES O SERVICIOS",null,null,null,null,null,null,"GÉNERO:",null,"EDAD:",null,"OBS:"]
[]
[null,"DÍGANOS COMO SE SIENTE RESPECTO A CADA PRODUCTO, MATERIAL O SERVICIO"]
[null,"· ESCOJA ENTRE 3 Y 5 EMOCIONES QUE UD. EXPERIMENTE CON MAYOR INTENSIDAD"]
[null,"· MARQUE CON UNA X LAS EMOCIONES Y LOS NIVELES DE INTENSIDAD ESCOGIDOS"]
[null,"· MARQUE SUS PREFERENCIAS CON UN DOBLE CLIC EN LA CELDA ESCOGIDA (PUEDE BORRAR DEL MISMO MODO)"]
[]
[]
[null,"EMOCIONES \\ INTENSIDAD","NADA","POCO","MEDIANAMENTE","BASTANTE","MUCHO","VALORACIÓN"]
[null,null,1.00000000001,2,3,4,5]
[null,{"$f":"User01!B13","v":"ALEGRÍA"},null,null,null,null,null,{"$f":"IF((SUMIF(C13:G13,\"X\",$C$12:$G$12)),(SUMIF(C13:G13,\"X\",$C$12:$G$12)), 1)","v":1}]
[null,{"$f":"User01!B14","v":"SATISFACCIÓN"},null,null,null,null,null,{"$f":"IF((SUMIF(C14:G14,\"X\",$C$12:$G$12)),(SUMIF(C14:G14,\"X\",$C$12:$G$12)), 1)","v":1}]
[null,{"$f":"User01!B15","v":"FASCINACIÓN"},null,null,null,null,null,1]
[null,{"$f":"User01!B16","v":"ABURRIMIENTO"},null,null,null,null,null,1]
[null,{"$f":"User01!B17","v":"ENFADO"},null,null,null,null,null,1]
[null,{"$f":"User01!B18","v":"TRISTEZA"},null,null,null,null,null,1]
[null,{"$f":"User01!B19","v":"VERGÜENZA"},null,null,null,null,null,1]
[null,{"$f":"User01!B20","v":"MIEDO"},null,null,null,null,null,1]
[null,{"$f":"User01!B21","v":"REPUGNANCIA"},null,null,null,null,null,1]
[null,{"$f":"User01!B22","v":"DESEO"},null,null,null,null,null,1]
[null,{"$f":"User01!B23","v":"ESPERANZA"},null,null,null,null,null,1]
[null,{"$f":"User01!B24","v":"ORGULLO"},null,null,null,null,null,1]
[]
[]
[]
[null,"EMOCIONES \\ INTENSIDAD","NADA","POCO","MEDIANAMENTE","BASTANTE","MUCHO","VALORACIÓN"]
[null,null,1.00000000001,2,3,4,5]
[null,{"$f":"$B13","v":"ALEGRÍA"},null,null,null,null,null,{"$f":"IF((SUMIF(C30:G30,\"X\",$C$29:$G$29)),(SUMIF(C30:G30,\"X\",$C$29:$G$29)), 1)","v":1}]
[null,"SATISFACCIÓN",null,null,null,null,null,{"$f":"IF((SUMIF(C31:G31,\"X\",$C$29:$G$29)),(SUMIF(C31:G31,\"X\",$C$29:$G$29)), 1)","v":1}]
[null,"FASCINACIÓN",null,null,null,null,null,1]
[null,"ABURRIMIENTO",null,null,null,null,null,1]
[null,"ENFADO",null,null,null,null,null,1]
[null,"TRISTEZA",null,null,null,null,null,1]
[null,"VERGÜENZA",null,null,null,null,null,1]
[null,"MIEDO",null,null,null,null,null,1]
[null,"REPUGNANCIA",null,null,null,null,null,1]
[null,"DESEO",null,null,null,null,null,1]
[null,"ESPERANZA",null,null,null,null,null,1]
[null,"ORGULLO",null,null,null,null,null,1]
[]
[]
[]
[null,"EMOCIONES \\ INTENSIDAD","NADA","POCO","MEDIANAMENTE","BASTANTE","MUCHO","VALORACIÓN"]
[null,null,1.00000000001,2,3,4,5]
[null,{"$f":"$B30","v":"ALEGRÍA"},null,null,null,null,null,{"$f":"IF((SUMIF(C47:G47,\"X\",$C$46:$G$46)),(SUMIF(C47:G47,\"X\",$C$46:$G$46)), 1)","v":1}]
[null,"SATISFACCIÓN",null,null,null,null,null,{"$f":"IF((SUMIF(C48:G48,\"X\",$C$46:$G$46)),(SUMIF(C48:G48,\"X\",$C$46:$G$46)), 1)","v":1}]
[null,"FASCINACIÓN",null,null,null,null,null,1]
[null,"ABURRIMIENTO",null,null,null,null,null,1]
[null,"ENFADO",null,null,null,null,null,1]
[null,"TRISTEZA",null,null,null,null,null,1]
[null,"VERGÜENZA",null,null,null,null,null,1]
[null,"MIEDO",null,null,null,null,null,1]
[null,"REPUGNANCIA",null,null,null,null,null,1]
[null,"DESEO",null,null,null,null,null,1]
[null,"ESPERANZA",null,null,null,null,null,1]
[null,"ORGULLO",null,null,null,null,null,1]
[]
[]
[]
[]
[null,"EMOCIONES \\ INTENSIDAD","NADA","POCO","MEDIANAMENTE","BASTANTE","MUCHO","VALORACIÓN"]
[null,null,1.00000000001,2,3,4,5]
[null,{"$f":"$B47","v":"ALEGRÍA"},null,null,null,null,null,{"$f":"IF((SUMIF(C65:G65,\"X\",$C$64:$G$64)),(SUMIF(C65:G65,\"X\",$C$64:$G$64)), 1)","v":1}]
[null,"SATISFACCIÓN",null,null,null,null,null,{"$f":"IF((SUMIF(C66:G66,\"X\",$C$64:$G$64)),(SUMIF(C66:G66,\"X\",$C$64:$G$64)), 1)","v":1}]
[null,"FASCINACIÓN",null,null,null,null,null,1]
[null,"ABURRIMIENTO",null,null,null,null,null,1]
[null,"ENFADO",null,null,null,null,null,1]
[null,"TRISTEZA",null,null,null,null,null,1]
[null,"VERGÜENZA",null,null,null,null,null,1]
[null,"MIEDO",null,null,null,null,null,1]
[null,"REPUGNANCIA",null,null,null,null,null,1]
[null,"DESEO",null,null,null,null,null,1]
[null,"ESPERANZA",null,null,null,null,null,1]
[null,"ORGULLO",null,null,null,null,null,1]
[]
[]
[]
[]
[null,"EMOCIONES \\ INTENSIDAD","NADA","POCO","MEDIANAMENTE","BASTANTE","MUCHO","VALORACIÓN"]
[null,null,1.00000000001,2,3,4,5]
[null,{"$f":"$B65","v":"ALEGRÍA"},null,null,null,null,null,{"$f":"IF((SUMIF(C83:G83,\"X\",$C$82:$G$82)),(SUMIF(C83:G83,\"X\",$C$82:$G$82)), 1)","v":1}]
[null,"SATISFACCIÓN",null,null,null,null,null,{"$f":"IF((SUMIF(C84:G84,\"X\",$C$82:$G$82)),(SUMIF(C84:G84,\"X\",$C$82:$G$82)), 1)","v":1}]
[null,"FASCINACIÓN",null,null,null,null,null,1]
[null,"ABURRIMIENTO",null,null,null,null,null,1]
[null,"ENFADO",null,null,null,null,null,1]
[null,"TRISTEZA",null,null,null,null,null,1]
[null,"VERGÜENZA",null,null,null,null,null,1]
[null,"MIEDO",null,null,null,null,null,1]
[null,"REPUGNANCIA",null,null,null,null,null,1]
[null,"DESEO",null,null,null,null,null,1]
[null,"ESPERANZA",null,null,null,null,null,1]
[null,"ORGULLO",null,null,null,null,null,1]
[]
[]
[]
[]
[null,"EMOCIONES \\ INTENSIDAD","NADA","POCO","MEDIANAMENTE","BASTANTE","MUCHO","VALORACIÓN"]
[null,null,1.00000000001,2,3,4,5]
[null,{"$f":"$B83","v":"ALEGRÍA"},null,null,null,null,null,{"$f":"IF((SUMIF(C101:G101,\"X\",$C$100:$G$100)),(SUMIF(C101:G101,\"X\",$C$100:$G$100)), 1)","v":1}]
[null,"SATISFACCIÓN",null,null,null,null,null,{"$f":"IF((SUMIF(C102:G102,\"X\",$C$100:$G$100)),(SUMIF(C102:G102,\"X\",$C$100:$G$100)), 1)","v":1}]
[null,"FASCINACIÓN",null,null,null,null,null,1]
[null,"ABURRIMIENTO",null,null,null,null,null,1]
[null,"ENFADO",null,null,null,null,null,1]
[null,"TRISTEZA",null,null,null,null,null,1]
[null,"VERGÜENZA",null,null,null,null,null,1]
[null,"MIEDO",null,null,null,null,null,1]
[null,"REPUGNANCIA",null,null,null,null,null,1]
[null,"DESEO",null,null,null,null,null,1]
[null,"ESPERANZA",null,null,null,null,null,1]
[null,"ORGULLO",null,null,null,null,null,1]

{"sheet":"User40","index":40,"n_rows":112,"n_cols":13,"rows_kept":112,"cut":false,"hidden":false,"merged":[[98,1,99,1],[98,7,99,7],[44,1,45,1],[44,7,45,7],[62,1,63,1],[62,7,63,7],[80,1,81,1],[80,7,81,7],[0,1,0,17],[2,13,5,17],[10,1,11,1],[10,7,11,7],[27,1,28,1],[27,7,28,7]]}
[null,"ESTAS TABLAS UTILIZAN MACROS DE EXCEL, POR LO TANTO CUANDO SE LE CONSULTE AL ABRIR EL ARCHIVO DEBE ACEPTAR Y HABILITAR LAS MACROS PARA QUE FUNCIONEN CORRECTAMENTE"]
[]
[null,"VALORACIÓN EMOCIONAL DE PRODUCTOS, MATERIALES O SERVICIOS",null,null,null,null,null,null,"GÉNERO:",null,"EDAD:",null,"OBS:"]
[]
[null,"DÍGANOS COMO SE SIENTE RESPECTO A CADA PRODUCTO, MATERIAL O SERVICIO"]
[null,"· ESCOJA ENTRE 3 Y 5 EMOCIONES QUE UD. EXPERIMENTE CON MAYOR INTENSIDAD"]
[null,"· MARQUE CON UNA X LAS EMOCIONES Y LOS NIVELES DE INTENSIDAD ESCOGIDOS"]
[null,"· MARQUE SUS PREFERENCIAS CON UN DOBLE CLIC EN LA CELDA ESCOGIDA (PUEDE BORRAR DEL MISMO MODO)"]
[]
[]
[null,"EMOCIONES \\ INTENSIDAD","NADA","POCO","MEDIANAMENTE","BASTANTE","MUCHO","VALORACIÓN"]
[null,null,1.00000000001,2,3,4,5]
[null,{"$f":"User01!B13","v":"ALEGRÍA"},null,null,null,null,null,{"$f":"IF((SUMIF(C13:G13,\"X\",$C$12:$G$12)),(SUMIF(C13:G13,\"X\",$C$12:$G$12)), 1)","v":1}]
[null,{"$f":"User01!B14","v":"SATISFACCIÓN"},null,null,null,null,null,{"$f":"IF((SUMIF(C14:G14,\"X\",$C$12:$G$12)),(SUMIF(C14:G14,\"X\",$C$12:$G$12)), 1)","v":1}]
[null,{"$f":"User01!B15","v":"FASCINACIÓN"},null,null,null,null,null,1]
[null,{"$f":"User01!B16","v":"ABURRIMIENTO"},null,null,null,null,null,1]
[null,{"$f":"User01!B17","v":"ENFADO"},null,null,null,null,null,1]
[null,{"$f":"User01!B18","v":"TRISTEZA"},null,null,null,null,null,1]
[null,{"$f":"User01!B19","v":"VERGÜENZA"},null,null,null,null,null,1]
[null,{"$f":"User01!B20","v":"MIEDO"},null,null,null,null,null,1]
[null,{"$f":"User01!B21","v":"REPUGNANCIA"},null,null,null,null,null,1]
[null,{"$f":"User01!B22","v":"DESEO"},null,null,null,null,null,1]
[null,{"$f":"User01!B23","v":"ESPERANZA"},null,null,null,null,null,1]
[null,{"$f":"User01!B24","v":"ORGULLO"},null,null,null,null,null,1]
[]
[]
[]
[null,"EMOCIONES \\ INTENSIDAD","NADA","POCO","MEDIANAMENTE","BASTANTE","MUCHO","VALORACIÓN"]
[null,null,1.00000000001,2,3,4,5]
[null,{"$f":"$B13","v":"ALEGRÍA"},null,null,null,null,null,{"$f":"IF((SUMIF(C30:G30,\"X\",$C$29:$G$29)),(SUMIF(C30:G30,\"X\",$C$29:$G$29)), 1)","v":1}]
[null,"SATISFACCIÓN",null,null,null,null,null,{"$f":"IF((SUMIF(C31:G31,\"X\",$C$29:$G$29)),(SUMIF(C31:G31,\"X\",$C$29:$G$29)), 1)","v":1}]
[null,"FASCINACIÓN",null,null,null,null,null,1]
[null,"ABURRIMIENTO",null,null,null,null,null,1]
[null,"ENFADO",null,null,null,null,null,1]
[null,"TRISTEZA",null,null,null,null,null,1]
[null,"VERGÜENZA",null,null,null,null,null,1]
[null,"MIEDO",null,null,null,null,null,1]
[null,"REPUGNANCIA",null,null,null,null,null,1]
[null,"DESEO",null,null,null,null,null,1]
[null,"ESPERANZA",null,null,null,null,null,1]
[null,"ORGULLO",null,null,null,null,null,1]
[]
[]
[]
[null,"EMOCIONES \\ INTENSIDAD","NADA","POCO","MEDIANAMENTE","BASTANTE","MUCHO","VALORACIÓN"]
[null,null,1.00000000001,2,3,4,5]
[null,{"$f":"$B30","v":"ALEGRÍA"},null,null,null,null,null,{"$f":"IF((SUMIF(C47:G47,\"X\",$C$46:$G$46)),(SUMIF(C47:G47,\"X\",$C$46:$G$46)), 1)","v":1}]
[null,"SATISFACCIÓN",null,null,null,null,null,{"$f":"IF((SUMIF(C48:G48,\"X\",$C$46:$G$46)),(SUMIF(C48:G48,\"X\",$C$46:$G$46)), 1)","v":1}]
[null,"FASCINACIÓN",null,null,null,null,null,1]
[null,"ABURRIMIENTO",null,null,null,null,null,1]
[null,"ENFADO",null,null,null,null,null,1]
[null,"TRISTEZA",null,null,null,null,null,1]
[null,"VERGÜENZA",null,null,null,null,null,1]
[null,"MIEDO",null,null,null,null,null,1]
[null,"REPUGNANCIA",null,null,null,null,null,1]
[null,"DESEO",null,null,null,null,null,1]
[null,"ESPERANZA",null,null,null,null,null,1]
[null,"ORGULLO",null,null,null,null,null,1]
[]
[]
[]
[]
[null,"EMOCIONES \\ INTENSIDAD","NADA","POCO","MEDIANAMENTE","BASTANTE","MUCHO","VALORACIÓN"]
[null,null,1.00000000001,2,3,4,5]
[null,{"$f":"$B47","v":"ALEGRÍA"},null,null,null,null,null,{"$f":"IF((SUMIF(C65:G65,\"X\",$C$64:$G$64)),(SUMIF(C65:G65,\"X\",$C$64:$G$64)), 1)","v":1}]
[null,"SATISFACCIÓN",null,null,null,null,null,{"$f":"IF((SUMIF(C66:G66,\"X\",$C$64:$G$64)),(SUMIF(C66:G66,\"X\",$C$64:$G$64)), 1)","v":1}]
[null,"FASCINACIÓN",null,null,null,null,null,1]
[null,"ABURRIMIENTO",null,null,null,null,null,1]
[null,"ENFADO",null,null,null,null,null,1]
[null,"TRISTEZA",null,null,null,null,null,1]
[null,"VERGÜENZA",null,null,null,null,null,1]
[null,"MIEDO",null,null,null,null,null,1]
[null,"REPUGNANCIA",null,null,null,null,null,1]
[null,"DESEO",null,null,null,null,null,1]
[null,"ESPERANZA",null,null,null,null,null,1]
[null,"ORGULLO",null,null,null,null,null,1]
[]
[]
[]
[]
[null,"EMOCIONES \\ INTENSIDAD","NADA","POCO","MEDIANAMENTE","BASTANTE","MUCHO","VALORACIÓN"]
[null,null,1.00000000001,2,3,4,5]
[null,{"$f":"$B65","v":"ALEGRÍA"},null,null,null,null,null,{"$f":"IF((SUMIF(C83:G83,\"X\",$C$82:$G$82)),(SUMIF(C83:G83,\"X\",$C$82:$G$82)), 1)","v":1}]
[null,"SATISFACCIÓN",null,null,null,null,null,{"$f":"IF((SUMIF(C84:G84,\"X\",$C$82:$G$82)),(SUMIF(C84:G84,\"X\",$C$82:$G$82)), 1)","v":1}]
[null,"FASCINACIÓN",null,null,null,null,null,1]
[null,"ABURRIMIENTO",null,null,null,null,null,1]
[null,"ENFADO",null,null,null,null,null,1]
[null,"TRISTEZA",null,null,null,null,null,1]
[null,"VERGÜENZA",null,null,null,null,null,1]
[null,"MIEDO",null,null,null,null,null,1]
[null,"REPUGNANCIA",null,null,null,null,null,1]
[null,"DESEO",null,null,null,null,null,1]
[null,"ESPERANZA",null,null,null,null,null,1]
[null,"ORGULLO",null,null,null,null,null,1]
[]
[]
[]
[]
[null,"EMOCIONES \\ INTENSIDAD","NADA","POCO","MEDIANAMENTE","BASTANTE","MUCHO","VALORACIÓN"]
[null,null,1.00000000001,2,3,4,5]
[null,{"$f":"$B83","v":"ALEGRÍA"},null,null,null,null,null,{"$f":"IF((SUMIF(C101:G101,\"X\",$C$100:$G$100)),(SUMIF(C101:G101,\"X\",$C$100:$G$100)), 1)","v":1}]
[null,"SATISFACCIÓN",null,null,null,null,null,{"$f":"IF((SUMIF(C102:G102,\"X\",$C$100:$G$100)),(SUMIF(C102:G102,\"X\",$C$100:$G$100)), 1)","v":1}]
[null,"FASCINACIÓN",null,null,null,null,null,1]
[null,"ABURRIMIENTO",null,null,null,null,null,1]
[null,"ENFADO",null,null,null,null,null,1]
[null,"TRISTEZA",null,null,null,null,null,1]
[null,"VERGÜENZA",null,null,null,null,null,1]
[null,"MIEDO",null,null,null,null,null,1]
[null,"REPUGNANCIA",null,null,null,null,null,1]
[null,"DESEO",null,null,null,null,null,1]
[null,"ESPERANZA",null,null,null,null,null,1]
[null,"ORGULLO",null,null,null,null,null,1]

{"sheet":"User41","index":41,"n_rows":112,"n_cols":13,"rows_kept":112,"cut":false,"hidden":false,"merged":[[98,1,99,1],[98,7,99,7],[44,1,45,1],[44,7,45,7],[62,1,63,1],[62,7,63,7],[80,1,81,1],[80,7,81,7],[0,1,0,17],[2,13,5,17],[10,1,11,1],[10,7,11,7],[27,1,28,1],[27,7,28,7]]}
[null,"ESTAS TABLAS UTILIZAN MACROS DE EXCEL, POR LO TANTO CUANDO SE LE CONSULTE AL ABRIR EL ARCHIVO DEBE ACEPTAR Y HABILITAR LAS MACROS PARA QUE FUNCIONEN CORRECTAMENTE"]
[]
[null,"VALORACIÓN EMOCIONAL DE PRODUCTOS, MATERIALES O SERVICIOS",null,null,null,null,null,null,"GÉNERO:",null,"EDAD:",null,"OBS:"]
[]
[null,"DÍGANOS COMO SE SIENTE RESPECTO A CADA PRODUCTO, MATERIAL O SERVICIO"]
[null,"· ESCOJA ENTRE 3 Y 5 EMOCIONES QUE UD. EXPERIMENTE CON MAYOR INTENSIDAD"]
[null,"· MARQUE CON UNA X LAS EMOCIONES Y LOS NIVELES DE INTENSIDAD ESCOGIDOS"]
[null,"· MARQUE SUS PREFERENCIAS CON UN DOBLE CLIC EN LA CELDA ESCOGIDA (PUEDE BORRAR DEL MISMO MODO)"]
[]
[]
[null,"EMOCIONES \\ INTENSIDAD","NADA","POCO","MEDIANAMENTE","BASTANTE","MUCHO","VALORACIÓN"]
[null,null,1.00000000001,2,3,4,5]
[null,{"$f":"User01!B13","v":"ALEGRÍA"},null,null,null,null,null,{"$f":"IF((SUMIF(C13:G13,\"X\",$C$12:$G$12)),(SUMIF(C13:G13,\"X\",$C$12:$G$12)), 1)","v":1}]
[null,{"$f":"User01!B14","v":"SATISFACCIÓN"},null,null,null,null,null,{"$f":"IF((SUMIF(C14:G14,\"X\",$C$12:$G$12)),(SUMIF(C14:G14,\"X\",$C$12:$G$12)), 1)","v":1}]
[null,{"$f":"User01!B15","v":"FASCINACIÓN"},null,null,null,null,null,1]
[null,{"$f":"User01!B16","v":"ABURRIMIENTO"},null,null,null,null,null,1]
[null,{"$f":"User01!B17","v":"ENFADO"},null,null,null,null,null,1]
[null,{"$f":"User01!B18","v":"TRISTEZA"},null,null,null,null,null,1]
[null,{"$f":"User01!B19","v":"VERGÜENZA"},null,null,null,null,null,1]
[null,{"$f":"User01!B20","v":"MIEDO"},null,null,null,null,null,1]
[null,{"$f":"User01!B21","v":"REPUGNANCIA"},null,null,null,null,null,1]
[null,{"$f":"User01!B22","v":"DESEO"},null,null,null,null,null,1]
[null,{"$f":"User01!B23","v":"ESPERANZA"},null,null,null,null,null,1]
[null,{"$f":"User01!B24","v":"ORGULLO"},null,null,null,null,null,1]
[]
[]
[]
[null,"EMOCIONES \\ INTENSIDAD","NADA","POCO","MEDIANAMENTE","BASTANTE","MUCHO","VALORACIÓN"]
[null,null,1.00000000001,2,3,4,5]
[null,{"$f":"$B13","v":"ALEGRÍA"},null,null,null,null,null,{"$f":"IF((SUMIF(C30:G30,\"X\",$C$29:$G$29)),(SUMIF(C30:G30,\"X\",$C$29:$G$29)), 1)","v":1}]
[null,"SATISFACCIÓN",null,null,null,null,null,{"$f":"IF((SUMIF(C31:G31,\"X\",$C$29:$G$29)),(SUMIF(C31:G31,\"X\",$C$29:$G$29)), 1)","v":1}]
[null,"FASCINACIÓN",null,null,null,null,null,1]
[null,"ABURRIMIENTO",null,null,null,null,null,1]
[null,"ENFADO",null,null,null,null,null,1]
[null,"TRISTEZA",null,null,null,null,null,1]
[null,"VERGÜENZA",null,null,null,null,null,1]
[null,"MIEDO",null,null,null,null,null,1]
[null,"REPUGNANCIA",null,null,null,null,null,1]
[null,"DESEO",null,null,null,null,null,1]
[null,"ESPERANZA",null,null,null,null,null,1]
[null,"ORGULLO",null,null,null,null,null,1]
[]
[]
[]
[null,"EMOCIONES \\ INTENSIDAD","NADA","POCO","MEDIANAMENTE","BASTANTE","MUCHO","VALORACIÓN"]
[null,null,1.00000000001,2,3,4,5]
[null,{"$f":"$B30","v":"ALEGRÍA"},null,null,null,null,null,{"$f":"IF((SUMIF(C47:G47,\"X\",$C$46:$G$46)),(SUMIF(C47:G47,\"X\",$C$46:$G$46)), 1)","v":1}]
[null,"SATISFACCIÓN",null,null,null,null,null,{"$f":"IF((SUMIF(C48:G48,\"X\",$C$46:$G$46)),(SUMIF(C48:G48,\"X\",$C$46:$G$46)), 1)","v":1}]
[null,"FASCINACIÓN",null,null,null,null,null,1]
[null,"ABURRIMIENTO",null,null,null,null,null,1]
[null,"ENFADO",null,null,null,null,null,1]
[null,"TRISTEZA",null,null,null,null,null,1]
[null,"VERGÜENZA",null,null,null,null,null,1]
[null,"MIEDO",null,null,null,null,null,1]
[null,"REPUGNANCIA",null,null,null,null,null,1]
[null,"DESEO",null,null,null,null,null,1]
[null,"ESPERANZA",null,null,null,null,null,1]
[null,"ORGULLO",null,null,null,null,null,1]
[]
[]
[]
[]
[null,"EMOCIONES \\ INTENSIDAD","NADA","POCO","MEDIANAMENTE","BASTANTE","MUCHO","VALORACIÓN"]
[null,null,1.00000000001,2,3,4,5]
[null,{"$f":"$B47","v":"ALEGRÍA"},null,null,null,null,null,{"$f":"IF((SUMIF(C65:G65,\"X\",$C$64:$G$64)),(SUMIF(C65:G65,\"X\",$C$64:$G$64)), 1)","v":1}]
[null,"SATISFACCIÓN",null,null,null,null,null,{"$f":"IF((SUMIF(C66:G66,\"X\",$C$64:$G$64)),(SUMIF(C66:G66,\"X\",$C$64:$G$64)), 1)","v":1}]
[null,"FASCINACIÓN",null,null,null,null,null,1]
[null,"ABURRIMIENTO",null,null,null,null,null,1]
[null,"ENFADO",null,null,null,null,null,1]
[null,"TRISTEZA",null,null,null,null,null,1]
[null,"VERGÜENZA",null,null,null,null,null,1]
[null,"MIEDO",null,null,null,null,null,1]
[null,"REPUGNANCIA",null,null,null,null,null,1]
[null,"DESEO",null,null,null,null,null,1]
[null,"ESPERANZA",null,null,null,null,null,1]
[null,"ORGULLO",null,null,null,null,null,1]
[]
[]
[]
[]
[null,"EMOCIONES \\ INTENSIDAD","NADA","POCO","MEDIANAMENTE","BASTANTE","MUCHO","VALORACIÓN"]
[null,null,1.00000000001,2,3,4,5]
[null,{"$f":"$B65","v":"ALEGRÍA"},null,null,null,null,null,{"$f":"IF((SUMIF(C83:G83,\"X\",$C$82:$G$82)),(SUMIF(C83:G83,\"X\",$C$82:$G$82)), 1)","v":1}]
[null,"SATISFACCIÓN",null,null,null,null,null,{"$f":"IF((SUMIF(C84:G84,\"X\",$C$82:$G$82)),(SUMIF(C84:G84,\"X\",$C$82:$G$82)), 1)","v":1}]
[null,"FASCINACIÓN",null,null,null,null,null,1]
[null,"ABURRIMIENTO",null,null,null,null,null,1]
[null,"ENFADO",null,null,null,null,null,1]
[null,"TRISTEZA",null,null,null,null,null,1]
[null,"VERGÜENZA",null,null,null,null,null,1]
[null,"MIEDO",null,null,null,null,null,1]
[null,"REPUGNANCIA",null,null,null,null,null,1]
[null,"DESEO",null,null,null,null,null,1]
[null,"ESPERANZA",null,null,null,null,null,1]
[null,"ORGULLO",null,null,null,null,null,1]
[]
[]
[]
[]
[null,"EMOCIONES \\ INTENSIDAD","NADA","POCO","MEDIANAMENTE","BASTANTE","MUCHO","VALORACIÓN"]
[null,null,1.00000000001,2,3,4,5]
[null,{"$f":"$B83","v":"ALEGRÍA"},null,null,null,null,null,{"$f":"IF((SUMIF(C101:G101,\"X\",$C$100:$G$100)),(SUMIF(C101:G101,\"X\",$C$100:$G$100)), 1)","v":1}]
[null,"SATISFACCIÓN",null,null,null,null,null,{"$f":"IF((SUMIF(C102:G102,\"X\",$C$100:$G$100)),(SUMIF(C102:G102,\"X\",$C$100:$G$100)), 1)","v":1}]
[null,"FASCINACIÓN",null,null,null,null,null,1]
[null,"ABURRIMIENTO",null,null,null,null,null,1]
[null,"ENFADO",null,null,null,null,null,1]
[null,"TRISTEZA",null,null,null,null,null,1]
[null,"VERGÜENZA",null,null,null,null,null,1]
[null,"MIEDO",null,null,null,null,null,1]
[null,"REPUGNANCIA",null,null,null,null,null,1]
[null,"DESEO",null,null,null,null,null,1]
[null,"ESPERANZA",null,null,null,null,null,1]
[null,"ORGULLO",null,null,null,null,null,1]

{"sheet":"User42","index":42,"n_rows":112,"n_cols":13,"rows_kept":112,"cut":false,"hidden":false,"merged":[[98,1,99,1],[98,7,99,7],[44,1,45,1],[44,7,45,7],[62,1,63,1],[62,7,63,7],[80,1,81,1],[80,7,81,7],[0,1,0,17],[2,13,5,17],[10,1,11,1],[10,7,11,7],[27,1,28,1],[27,7,28,7]]}
[null,"ESTAS TABLAS UTILIZAN MACROS DE EXCEL, POR LO TANTO CUANDO SE LE CONSULTE AL ABRIR EL ARCHIVO DEBE ACEPTAR Y HABILITAR LAS MACROS PARA QUE FUNCIONEN CORRECTAMENTE"]
[]
[null,"VALORACIÓN EMOCIONAL DE PRODUCTOS, MATERIALES O SERVICIOS",null,null,null,null,null,null,"GÉNERO:",null,"EDAD:",null,"OBS:"]
[]
[null,"DÍGANOS COMO SE SIENTE RESPECTO A CADA PRODUCTO, MATERIAL O SERVICIO"]
[null,"· ESCOJA ENTRE 3 Y 5 EMOCIONES QUE UD. EXPERIMENTE CON MAYOR INTENSIDAD"]
[null,"· MARQUE CON UNA X LAS EMOCIONES Y LOS NIVELES DE INTENSIDAD ESCOGIDOS"]
[null,"· MARQUE SUS PREFERENCIAS CON UN DOBLE CLIC EN LA CELDA ESCOGIDA (PUEDE BORRAR DEL MISMO MODO)"]
[]
[]
[null,"EMOCIONES \\ INTENSIDAD","NADA","POCO","MEDIANAMENTE","BASTANTE","MUCHO","VALORACIÓN"]
[null,null,1.00000000001,2,3,4,5]
[null,{"$f":"User01!B13","v":"ALEGRÍA"},null,null,null,null,null,{"$f":"IF((SUMIF(C13:G13,\"X\",$C$12:$G$12)),(SUMIF(C13:G13,\"X\",$C$12:$G$12)), 1)","v":1}]
[null,{"$f":"User01!B14","v":"SATISFACCIÓN"},null,null,null,null,null,{"$f":"IF((SUMIF(C14:G14,\"X\",$C$12:$G$12)),(SUMIF(C14:G14,\"X\",$C$12:$G$12)), 1)","v":1}]
[null,{"$f":"User01!B15","v":"FASCINACIÓN"},null,null,null,null,null,1]
[null,{"$f":"User01!B16","v":"ABURRIMIENTO"},null,null,null,null,null,1]
[null,{"$f":"User01!B17","v":"ENFADO"},null,null,null,null,null,1]
[null,{"$f":"User01!B18","v":"TRISTEZA"},null,null,null,null,null,1]
[null,{"$f":"User01!B19","v":"VERGÜENZA"},null,null,null,null,null,1]
[null,{"$f":"User01!B20","v":"MIEDO"},null,null,null,null,null,1]
[null,{"$f":"User01!B21","v":"REPUGNANCIA"},null,null,null,null,null,1]
[null,{"$f":"User01!B22","v":"DESEO"},null,null,null,null,null,1]
[null,{"$f":"User01!B23","v":"ESPERANZA"},null,null,null,null,null,1]
[null,{"$f":"User01!B24","v":"ORGULLO"},null,null,null,null,null,1]
[]
[]
[]
[null,"EMOCIONES \\ INTENSIDAD","NADA","POCO","MEDIANAMENTE","BASTANTE","MUCHO","VALORACIÓN"]
[null,null,1.00000000001,2,3,4,5]
[null,{"$f":"$B13","v":"ALEGRÍA"},null,null,null,null,null,{"$f":"IF((SUMIF(C30:G30,\"X\",$C$29:$G$29)),(SUMIF(C30:G30,\"X\",$C$29:$G$29)), 1)","v":1}]
[null,"SATISFACCIÓN",null,null,null,null,null,{"$f":"IF((SUMIF(C31:G31,\"X\",$C$29:$G$29)),(SUMIF(C31:G31,\"X\",$C$29:$G$29)), 1)","v":1}]
[null,"FASCINACIÓN",null,null,null,null,null,1]
[null,"ABURRIMIENTO",null,null,null,null,null,1]
[null,"ENFADO",null,null,null,null,null,1]
[null,"TRISTEZA",null,null,null,null,null,1]
[null,"VERGÜENZA",null,null,null,null,null,1]
[null,"MIEDO",null,null,null,null,null,1]
[null,"REPUGNANCIA",null,null,null,null,null,1]
[null,"DESEO",null,null,null,null,null,1]
[null,"ESPERANZA",null,null,null,null,null,1]
[null,"ORGULLO",null,null,null,null,null,1]
[]
[]
[]
[null,"EMOCIONES \\ INTENSIDAD","NADA","POCO","MEDIANAMENTE","BASTANTE","MUCHO","VALORACIÓN"]
[null,null,1.00000000001,2,3,4,5]
[null,{"$f":"$B30","v":"ALEGRÍA"},null,null,null,null,null,{"$f":"IF((SUMIF(C47:G47,\"X\",$C$46:$G$46)),(SUMIF(C47:G47,\"X\",$C$46:$G$46)), 1)","v":1}]
[null,"SATISFACCIÓN",null,null,null,null,null,{"$f":"IF((SUMIF(C48:G48,\"X\",$C$46:$G$46)),(SUMIF(C48:G48,\"X\",$C$46:$G$46)), 1)","v":1}]
[null,"FASCINACIÓN",null,null,null,null,null,1]
[null,"ABURRIMIENTO",null,null,null,null,null,1]
[null,"ENFADO",null,null,null,null,null,1]
[null,"TRISTEZA",null,null,null,null,null,1]
[null,"VERGÜENZA",null,null,null,null,null,1]
[null,"MIEDO",null,null,null,null,null,1]
[null,"REPUGNANCIA",null,null,null,null,null,1]
[null,"DESEO",null,null,null,null,null,1]
[null,"ESPERANZA",null,null,null,null,null,1]
[null,"ORGULLO",null,null,null,null,null,1]
[]
[]
[]
[]
[null,"EMOCIONES \\ INTENSIDAD","NADA","POCO","MEDIANAMENTE","BASTANTE","MUCHO","VALORACIÓN"]
[null,null,1.00000000001,2,3,4,5]
[null,{"$f":"$B47","v":"ALEGRÍA"},null,null,null,null,null,{"$f":"IF((SUMIF(C65:G65,\"X\",$C$64:$G$64)),(SUMIF(C65:G65,\"X\",$C$64:$G$64)), 1)","v":1}]
[null,"SATISFACCIÓN",null,null,null,null,null,{"$f":"IF((SUMIF(C66:G66,\"X\",$C$64:$G$64)),(SUMIF(C66:G66,\"X\",$C$64:$G$64)), 1)","v":1}]
[null,"FASCINACIÓN",null,null,null,null,null,1]
[null,"ABURRIMIENTO",null,null,null,null,null,1]
[null,"ENFADO",null,null,null,null,null,1]
[null,"TRISTEZA",null,null,null,null,null,1]
[null,"VERGÜENZA",null,null,null,null,null,1]
[null,"MIEDO",null,null,null,null,null,1]
[null,"REPUGNANCIA",null,null,null,null,null,1]
[null,"DESEO",null,null,null,null,null,1]
[null,"ESPERANZA",null,null,null,null,null,1]
[null,"ORGULLO",null,null,null,null,null,1]
[]
[]
[]
[]
[null,"EMOCIONES \\ INTENSIDAD","NADA","POCO","MEDIANAMENTE","BASTANTE","MUCHO","VALORACIÓN"]
[null,null,1.00000000001,2,3,4,5]
[null,{"$f":"$B65","v":"ALEGRÍA"},null,null,null,null,null,{"$f":"IF((SUMIF(C83:G83,\"X\",$C$82:$G$82)),(SUMIF(C83:G83,\"X\",$C$82:$G$82)), 1)","v":1}]
[null,"SATISFACCIÓN",null,null,null,null,null,{"$f":"IF((SUMIF(C84:G84,\"X\",$C$82:$G$82)),(SUMIF(C84:G84,\"X\",$C$82:$G$82)), 1)","v":1}]
[null,"FASCINACIÓN",null,null,null,null,null,1]
[null,"ABURRIMIENTO",null,null,null,null,null,1]
[null,"ENFADO",null,null,null,null,null,1]
[null,"TRISTEZA",null,null,null,null,null,1]
[null,"VERGÜENZA",null,null,null,null,null,1]
[null,"MIEDO",null,null,null,null,null,1]
[null,"REPUGNANCIA",null,null,null,null,null,1]
[null,"DESEO",null,null,null,null,null,1]
[null,"ESPERANZA",null,null,null,null,null,1]
[null,"ORGULLO",null,null,null,null,null,1]
[]
[]
[]
[]
[null,"EMOCIONES \\ INTENSIDAD","NADA","POCO","MEDIANAMENTE","BASTANTE","MUCHO","VALORACIÓN"]
[null,null,1.00000000001,2,3,4,5]
[null,{"$f":"$B83","v":"ALEGRÍA"},null,null,null,null,null,{"$f":"IF((SUMIF(C101:G101,\"X\",$C$100:$G$100)),(SUMIF(C101:G101,\"X\",$C$100:$G$100)), 1)","v":1}]
[null,"SATISFACCIÓN",null,null,null,null,null,{"$f":"IF((SUMIF(C102:G102,\"X\",$C$100:$G$100)),(SUMIF(C102:G102,\"X\",$C$100:$G$100)), 1)","v":1}]
[null,"FASCINACIÓN",null,null,null,null,null,1]
[null,"ABURRIMIENTO",null,null,null,null,null,1]
[null,"ENFADO",null,null,null,null,null,1]
[null,"TRISTEZA",null,null,null,null,null,1]
[null,"VERGÜENZA",null,null,null,null,null,1]
[null,"MIEDO",null,null,null,null,null,1]
[null,"REPUGNANCIA",null,null,null,null,null,1]
[null,"DESEO",null,null,null,null,null,1]
[null,"ESPERANZA",null,null,null,null,null,1]
[null,"ORGULLO",null,null,null,null,null,1]

{"sheet":"User43","index":43,"n_rows":112,"n_cols":13,"rows_kept":112,"cut":false,"hidden":false,"merged":[[98,1,99,1],[98,7,99,7],[44,1,45,1],[44,7,45,7],[62,1,63,1],[62,7,63,7],[80,1,81,1],[80,7,81,7],[0,1,0,17],[2,13,5,17],[10,1,11,1],[10,7,11,7],[27,1,28,1],[27,7,28,7]]}
[null,"ESTAS TABLAS UTILIZAN MACROS DE EXCEL, POR LO TANTO CUANDO SE LE CONSULTE AL ABRIR EL ARCHIVO DEBE ACEPTAR Y HABILITAR LAS MACROS PARA QUE FUNCIONEN CORRECTAMENTE"]
[]
[null,"VALORACIÓN EMOCIONAL DE PRODUCTOS, MATERIALES O SERVICIOS",null,null,null,null,null,null,"GÉNERO:",null,"EDAD:",null,"OBS:"]
[]
[null,"DÍGANOS COMO SE SIENTE RESPECTO A CADA PRODUCTO, MATERIAL O SERVICIO"]
[null,"· ESCOJA ENTRE 3 Y 5 EMOCIONES QUE UD. EXPERIMENTE CON MAYOR INTENSIDAD"]
[null,"· MARQUE CON UNA X LAS EMOCIONES Y LOS NIVELES DE INTENSIDAD ESCOGIDOS"]
[null,"· MARQUE SUS PREFERENCIAS CON UN DOBLE CLIC EN LA CELDA ESCOGIDA (PUEDE BORRAR DEL MISMO MODO)"]
[]
[]
[null,"EMOCIONES \\ INTENSIDAD","NADA","POCO","MEDIANAMENTE","BASTANTE","MUCHO","VALORACIÓN"]
[null,null,1.00000000001,2,3,4,5]
[null,{"$f":"User01!B13","v":"ALEGRÍA"},null,null,null,null,null,{"$f":"IF((SUMIF(C13:G13,\"X\",$C$12:$G$12)),(SUMIF(C13:G13,\"X\",$C$12:$G$12)), 1)","v":1}]
[null,{"$f":"User01!B14","v":"SATISFACCIÓN"},null,null,null,null,null,{"$f":"IF((SUMIF(C14:G14,\"X\",$C$12:$G$12)),(SUMIF(C14:G14,\"X\",$C$12:$G$12)), 1)","v":1}]
[null,{"$f":"User01!B15","v":"FASCINACIÓN"},null,null,null,null,null,1]
[null,{"$f":"User01!B16","v":"ABURRIMIENTO"},null,null,null,null,null,1]
[null,{"$f":"User01!B17","v":"ENFADO"},null,null,null,null,null,1]
[null,{"$f":"User01!B18","v":"TRISTEZA"},null,null,null,null,null,1]
[null,{"$f":"User01!B19","v":"VERGÜENZA"},null,null,null,null,null,1]
[null,{"$f":"User01!B20","v":"MIEDO"},null,null,null,null,null,1]
[null,{"$f":"User01!B21","v":"REPUGNANCIA"},null,null,null,null,null,1]
[null,{"$f":"User01!B22","v":"DESEO"},null,null,null,null,null,1]
[null,{"$f":"User01!B23","v":"ESPERANZA"},null,null,null,null,null,1]
[null,{"$f":"User01!B24","v":"ORGULLO"},null,null,null,null,null,1]
[]
[]
[]
[null,"EMOCIONES \\ INTENSIDAD","NADA","POCO","MEDIANAMENTE","BASTANTE","MUCHO","VALORACIÓN"]
[null,null,1.00000000001,2,3,4,5]
[null,{"$f":"$B13","v":"ALEGRÍA"},null,null,null,null,null,{"$f":"IF((SUMIF(C30:G30,\"X\",$C$29:$G$29)),(SUMIF(C30:G30,\"X\",$C$29:$G$29)), 1)","v":1}]
[null,"SATISFACCIÓN",null,null,null,null,null,{"$f":"IF((SUMIF(C31:G31,\"X\",$C$29:$G$29)),(SUMIF(C31:G31,\"X\",$C$29:$G$29)), 1)","v":1}]
[null,"FASCINACIÓN",null,null,null,null,null,1]
[null,"ABURRIMIENTO",null,null,null,null,null,1]
[null,"ENFADO",null,null,null,null,null,1]
[null,"TRISTEZA",null,null,null,null,null,1]
[null,"VERGÜENZA",null,null,null,null,null,1]
[null,"MIEDO",null,null,null,null,null,1]
[null,"REPUGNANCIA",null,null,null,null,null,1]
[null,"DESEO",null,null,null,null,null,1]
[null,"ESPERANZA",null,null,null,null,null,1]
[null,"ORGULLO",null,null,null,null,null,1]
[]
[]
[]
[null,"EMOCIONES \\ INTENSIDAD","NADA","POCO","MEDIANAMENTE","BASTANTE","MUCHO","VALORACIÓN"]
[null,null,1.00000000001,2,3,4,5]
[null,{"$f":"$B30","v":"ALEGRÍA"},null,null,null,null,null,{"$f":"IF((SUMIF(C47:G47,\"X\",$C$46:$G$46)),(SUMIF(C47:G47,\"X\",$C$46:$G$46)), 1)","v":1}]
[null,"SATISFACCIÓN",null,null,null,null,null,{"$f":"IF((SUMIF(C48:G48,\"X\",$C$46:$G$46)),(SUMIF(C48:G48,\"X\",$C$46:$G$46)), 1)","v":1}]
[null,"FASCINACIÓN",null,null,null,null,null,1]
[null,"ABURRIMIENTO",null,null,null,null,null,1]
[null,"ENFADO",null,null,null,null,null,1]
[null,"TRISTEZA",null,null,null,null,null,1]
[null,"VERGÜENZA",null,null,null,null,null,1]
[null,"MIEDO",null,null,null,null,null,1]
[null,"REPUGNANCIA",null,null,null,null,null,1]
[null,"DESEO",null,null,null,null,null,1]
[null,"ESPERANZA",null,null,null,null,null,1]
[null,"ORGULLO",null,null,null,null,null,1]
[]
[]
[]
[]
[null,"EMOCIONES \\ INTENSIDAD","NADA","POCO","MEDIANAMENTE","BASTANTE","MUCHO","VALORACIÓN"]
[null,null,1.00000000001,2,3,4,5]
[null,{"$f":"$B47","v":"ALEGRÍA"},null,null,null,null,null,{"$f":"IF((SUMIF(C65:G65,\"X\",$C$64:$G$64)),(SUMIF(C65:G65,\"X\",$C$64:$G$64)), 1)","v":1}]
[null,"SATISFACCIÓN",null,null,null,null,null,{"$f":"IF((SUMIF(C66:G66,\"X\",$C$64:$G$64)),(SUMIF(C66:G66,\"X\",$C$64:$G$64)), 1)","v":1}]
[null,"FASCINACIÓN",null,null,null,null,null,1]
[null,"ABURRIMIENTO",null,null,null,null,null,1]
[null,"ENFADO",null,null,null,null,null,1]
[null,"TRISTEZA",null,null,null,null,null,1]
[null,"VERGÜENZA",null,null,null,null,null,1]
[null,"MIEDO",null,null,null,null,null,1]
[null,"REPUGNANCIA",null,null,null,null,null,1]
[null,"DESEO",null,null,null,null,null,1]
[null,"ESPERANZA",null,null,null,null,null,1]
[null,"ORGULLO",null,null,null,null,null,1]
[]
[]
[]
[]
[null,"EMOCIONES \\ INTENSIDAD","NADA","POCO","MEDIANAMENTE","BASTANTE","MUCHO","VALORACIÓN"]
[null,null,1.00000000001,2,3,4,5]
[null,{"$f":"$B65","v":"ALEGRÍA"},null,null,null,null,null,{"$f":"IF((SUMIF(C83:G83,\"X\",$C$82:$G$82)),(SUMIF(C83:G83,\"X\",$C$82:$G$82)), 1)","v":1}]
[null,"SATISFACCIÓN",null,null,null,null,null,{"$f":"IF((SUMIF(C84:G84,\"X\",$C$82:$G$82)),(SUMIF(C84:G84,\"X\",$C$82:$G$82)), 1)","v":1}]
[null,"FASCINACIÓN",null,null,null,null,null,1]
[null,"ABURRIMIENTO",null,null,null,null,null,1]
[null,"ENFADO",null,null,null,null,null,1]
[null,"TRISTEZA",null,null,null,null,null,1]
[null,"VERGÜENZA",null,null,null,null,null,1]
[null,"MIEDO",null,null,null,null,null,1]
[null,"REPUGNANCIA",null,null,null,null,null,1]
[null,"DESEO",null,null,null,null,null,1]
[null,"ESPERANZA",null,null,null,null,null,1]
[null,"ORGULLO",null,null,null,null,null,1]
[]
[]
[]
[]
[null,"EMOCIONES \\ INTENSIDAD","NADA","POCO","MEDIANAMENTE","BASTANTE","MUCHO","VALORACIÓN"]
[null,null,1.00000000001,2,3,4,5]
[null,{"$f":"$B83","v":"ALEGRÍA"},null,null,null,null,null,{"$f":"IF((SUMIF(C101:G101,\"X\",$C$100:$G$100)),(SUMIF(C101:G101,\"X\",$C$100:$G$100)), 1)","v":1}]
[null,"SATISFACCIÓN",null,null,null,null,null,{"$f":"IF((SUMIF(C102:G102,\"X\",$C$100:$G$100)),(SUMIF(C102:G102,\"X\",$C$100:$G$100)), 1)","v":1}]
[null,"FASCINACIÓN",null,null,null,null,null,1]
[null,"ABURRIMIENTO",null,null,null,null,null,1]
[null,"ENFADO",null,null,null,null,null,1]
[null,"TRISTEZA",null,null,null,null,null,1]
[null,"VERGÜENZA",null,null,null,null,null,1]
[null,"MIEDO",null,null,null,null,null,1]
[null,"REPUGNANCIA",null,null,null,null,null,1]
[null,"DESEO",null,null,null,null,null,1]
[null,"ESPERANZA",null,null,null,null,null,1]
[null,"ORGULLO",null,null,null,null,null,1]

{"sheet":"User44","index":44,"n_rows":112,"n_cols":13,"rows_kept":112,"cut":false,"hidden":false,"merged":[[98,1,99,1],[98,7,99,7],[44,1,45,1],[44,7,45,7],[62,1,63,1],[62,7,63,7],[80,1,81,1],[80,7,81,7],[0,1,0,17],[2,13,5,17],[10,1,11,1],[10,7,11,7],[27,1,28,1],[27,7,28,7]]}
[null,"ESTAS TABLAS UTILIZAN MACROS DE EXCEL, POR LO TANTO CUANDO SE LE CONSULTE AL ABRIR EL ARCHIVO DEBE ACEPTAR Y HABILITAR LAS MACROS PARA QUE FUNCIONEN CORRECTAMENTE"]
[]
[null,"VALORACIÓN EMOCIONAL DE PRODUCTOS, MATERIALES O SERVICIOS",null,null,null,null,null,null,"GÉNERO:",null,"EDAD:",null,"OBS:"]
[]
[null,"DÍGANOS COMO SE SIENTE RESPECTO A CADA PRODUCTO, MATERIAL O SERVICIO"]
[null,"· ESCOJA ENTRE 3 Y 5 EMOCIONES QUE UD. EXPERIMENTE CON MAYOR INTENSIDAD"]
[null,"· MARQUE CON UNA X LAS EMOCIONES Y LOS NIVELES DE INTENSIDAD ESCOGIDOS"]
[null,"· MARQUE SUS PREFERENCIAS CON UN DOBLE CLIC EN LA CELDA ESCOGIDA (PUEDE BORRAR DEL MISMO MODO)"]
[]
[]
[null,"EMOCIONES \\ INTENSIDAD","NADA","POCO","MEDIANAMENTE","BASTANTE","MUCHO","VALORACIÓN"]
[null,null,1.00000000001,2,3,4,5]
[null,{"$f":"User01!B13","v":"ALEGRÍA"},null,null,null,null,null,{"$f":"IF((SUMIF(C13:G13,\"X\",$C$12:$G$12)),(SUMIF(C13:G13,\"X\",$C$12:$G$12)), 1)","v":1}]
[null,{"$f":"User01!B14","v":"SATISFACCIÓN"},null,null,null,null,null,{"$f":"IF((SUMIF(C14:G14,\"X\",$C$12:$G$12)),(SUMIF(C14:G14,\"X\",$C$12:$G$12)), 1)","v":1}]
[null,{"$f":"User01!B15","v":"FASCINACIÓN"},null,null,null,null,null,1]
[null,{"$f":"User01!B16","v":"ABURRIMIENTO"},null,null,null,null,null,1]
[null,{"$f":"User01!B17","v":"ENFADO"},null,null,null,null,null,1]
[null,{"$f":"User01!B18","v":"TRISTEZA"},null,null,null,null,null,1]
[null,{"$f":"User01!B19","v":"VERGÜENZA"},null,null,null,null,null,1]
[null,{"$f":"User01!B20","v":"MIEDO"},null,null,null,null,null,1]
[null,{"$f":"User01!B21","v":"REPUGNANCIA"},null,null,null,null,null,1]
[null,{"$f":"User01!B22","v":"DESEO"},null,null,null,null,null,1]
[null,{"$f":"User01!B23","v":"ESPERANZA"},null,null,null,null,null,1]
[null,{"$f":"User01!B24","v":"ORGULLO"},null,null,null,null,null,1]
[]
[]
[]
[null,"EMOCIONES \\ INTENSIDAD","NADA","POCO","MEDIANAMENTE","BASTANTE","MUCHO","VALORACIÓN"]
[null,null,1.00000000001,2,3,4,5]
[null,{"$f":"$B13","v":"ALEGRÍA"},null,null,null,null,null,{"$f":"IF((SUMIF(C30:G30,\"X\",$C$29:$G$29)),(SUMIF(C30:G30,\"X\",$C$29:$G$29)), 1)","v":1}]
[null,"SATISFACCIÓN",null,null,null,null,null,{"$f":"IF((SUMIF(C31:G31,\"X\",$C$29:$G$29)),(SUMIF(C31:G31,\"X\",$C$29:$G$29)), 1)","v":1}]
[null,"FASCINACIÓN",null,null,null,null,null,1]
[null,"ABURRIMIENTO",null,null,null,null,null,1]
[null,"ENFADO",null,null,null,null,null,1]
[null,"TRISTEZA",null,null,null,null,null,1]
[null,"VERGÜENZA",null,null,null,null,null,1]
[null,"MIEDO",null,null,null,null,null,1]
[null,"REPUGNANCIA",null,null,null,null,null,1]
[null,"DESEO",null,null,null,null,null,1]
[null,"ESPERANZA",null,null,null,null,null,1]
[null,"ORGULLO",null,null,null,null,null,1]
[]
[]
[]
[null,"EMOCIONES \\ INTENSIDAD","NADA","POCO","MEDIANAMENTE","BASTANTE","MUCHO","VALORACIÓN"]
[null,null,1.00000000001,2,3,4,5]
[null,{"$f":"$B30","v":"ALEGRÍA"},null,null,null,null,null,{"$f":"IF((SUMIF(C47:G47,\"X\",$C$46:$G$46)),(SUMIF(C47:G47,\"X\",$C$46:$G$46)), 1)","v":1}]
[null,"SATISFACCIÓN",null,null,null,null,null,{"$f":"IF((SUMIF(C48:G48,\"X\",$C$46:$G$46)),(SUMIF(C48:G48,\"X\",$C$46:$G$46)), 1)","v":1}]
[null,"FASCINACIÓN",null,null,null,null,null,1]
[null,"ABURRIMIENTO",null,null,null,null,null,1]
[null,"ENFADO",null,null,null,null,null,1]
[null,"TRISTEZA",null,null,null,null,null,1]
[null,"VERGÜENZA",null,null,null,null,null,1]
[null,"MIEDO",null,null,null,null,null,1]
[null,"REPUGNANCIA",null,null,null,null,null,1]
[null,"DESEO",null,null,null,null,null,1]
[null,"ESPERANZA",null,null,null,null,null,1]
[null,"ORGULLO",null,null,null,null,null,1]
[]
[]
[]
[]
[null,"EMOCIONES \\ INTENSIDAD","NADA","POCO","MEDIANAMENTE","BASTANTE","MUCHO","VALORACIÓN"]
[null,null,1.00000000001,2,3,4,5]
[null,{"$f":"$B47","v":"ALEGRÍA"},null,null,null,null,null,{"$f":"IF((SUMIF(C65:G65,\"X\",$C$64:$G$64)),(SUMIF(C65:G65,\"X\",$C$64:$G$64)), 1)","v":1}]
[null,"SATISFACCIÓN",null,null,null,null,null,{"$f":"IF((SUMIF(C66:G66,\"X\",$C$64:$G$64)),(SUMIF(C66:G66,\"X\",$C$64:$G$64)), 1)","v":1}]
[null,"FASCINACIÓN",null,null,null,null,null,1]
[null,"ABURRIMIENTO",null,null,null,null,null,1]
[null,"ENFADO",null,null,null,null,null,1]
[null,"TRISTEZA",null,null,null,null,null,1]
[null,"VERGÜENZA",null,null,null,null,null,1]
[null,"MIEDO",null,null,null,null,null,1]
[null,"REPUGNANCIA",null,null,null,null,null,1]
[null,"DESEO",null,null,null,null,null,1]
[null,"ESPERANZA",null,null,null,null,null,1]
[null,"ORGULLO",null,null,null,null,null,1]
[]
[]
[]
[]
[null,"EMOCIONES \\ INTENSIDAD","NADA","POCO","MEDIANAMENTE","BASTANTE","MUCHO","VALORACIÓN"]
[null,null,1.00000000001,2,3,4,5]
[null,{"$f":"$B65","v":"ALEGRÍA"},null,null,null,null,null,{"$f":"IF((SUMIF(C83:G83,\"X\",$C$82:$G$82)),(SUMIF(C83:G83,\"X\",$C$82:$G$82)), 1)","v":1}]
[null,"SATISFACCIÓN",null,null,null,null,null,{"$f":"IF((SUMIF(C84:G84,\"X\",$C$82:$G$82)),(SUMIF(C84:G84,\"X\",$C$82:$G$82)), 1)","v":1}]
[null,"FASCINACIÓN",null,null,null,null,null,1]
[null,"ABURRIMIENTO",null,null,null,null,null,1]
[null,"ENFADO",null,null,null,null,null,1]
[null,"TRISTEZA",null,null,null,null,null,1]
[null,"VERGÜENZA",null,null,null,null,null,1]
[null,"MIEDO",null,null,null,null,null,1]
[null,"REPUGNANCIA",null,null,null,null,null,1]
[null,"DESEO",null,null,null,null,null,1]
[null,"ESPERANZA",null,null,null,null,null,1]
[null,"ORGULLO",null,null,null,null,null,1]
[]
[]
[]
[]
[null,"EMOCIONES \\ INTENSIDAD","NADA","POCO","MEDIANAMENTE","BASTANTE","MUCHO","VALORACIÓN"]
[null,null,1.00000000001,2,3,4,5]
[null,{"$f":"$B83","v":"ALEGRÍA"},null,null,null,null,null,{"$f":"IF((SUMIF(C101:G101,\"X\",$C$100:$G$100)),(SUMIF(C101:G101,\"X\",$C$100:$G$100)), 1)","v":1}]
[null,"SATISFACCIÓN",null,null,null,null,null,{"$f":"IF((SUMIF(C102:G102,\"X\",$C$100:$G$100)),(SUMIF(C102:G102,\"X\",$C$100:$G$100)), 1)","v":1}]
[null,"FASCINACIÓN",null,null,null,null,null,1]
[null,"ABURRIMIENTO",null,null,null,null,null,1]
[null,"ENFADO",null,null,null,null,null,1]
[null,"TRISTEZA",null,null,null,null,null,1]
[null,"VERGÜENZA",null,null,null,null,null,1]
[null,"MIEDO",null,null,null,null,null,1]
[null,"REPUGNANCIA",null,null,null,null,null,1]
[null,"DESEO",null,null,null,null,null,1]
[null,"ESPERANZA",null,null,null,null,null,1]
[null,"ORGULLO",null,null,null,null,null,1]

{"sheet":"User45","index":45,"n_rows":112,"n_cols":13,"rows_kept":112,"cut":false,"hidden":false,"merged":[[98,1,99,1],[98,7,99,7],[44,1,45,1],[44,7,45,7],[62,1,63,1],[62,7,63,7],[80,1,81,1],[80,7,81,7],[0,1,0,17],[2,13,5,17],[10,1,11,1],[10,7,11,7],[27,1,28,1],[27,7,28,7]]}
[null,"ESTAS TABLAS UTILIZAN MACROS DE EXCEL, POR LO TANTO CUANDO SE LE CONSULTE AL ABRIR EL ARCHIVO DEBE ACEPTAR Y HABILITAR LAS MACROS PARA QUE FUNCIONEN CORRECTAMENTE"]
[]
[null,"VALORACIÓN EMOCIONAL DE PRODUCTOS, MATERIALES O SERVICIOS",null,null,null,null,null,null,"GÉNERO:",null,"EDAD:",null,"OBS:"]
[]
[null,"DÍGANOS COMO SE SIENTE RESPECTO A CADA PRODUCTO, MATERIAL O SERVICIO"]
[null,"· ESCOJA ENTRE 3 Y 5 EMOCIONES QUE UD. EXPERIMENTE CON MAYOR INTENSIDAD"]
[null,"· MARQUE CON UNA X LAS EMOCIONES Y LOS NIVELES DE INTENSIDAD ESCOGIDOS"]
[null,"· MARQUE SUS PREFERENCIAS CON UN DOBLE CLIC EN LA CELDA ESCOGIDA (PUEDE BORRAR DEL MISMO MODO)"]
[]
[]
[null,"EMOCIONES \\ INTENSIDAD","NADA","POCO","MEDIANAMENTE","BASTANTE","MUCHO","VALORACIÓN"]
[null,null,1.00000000001,2,3,4,5]
[null,{"$f":"User01!B13","v":"ALEGRÍA"},null,null,null,null,null,{"$f":"IF((SUMIF(C13:G13,\"X\",$C$12:$G$12)),(SUMIF(C13:G13,\"X\",$C$12:$G$12)), 1)","v":1}]
[null,{"$f":"User01!B14","v":"SATISFACCIÓN"},null,null,null,null,null,{"$f":"IF((SUMIF(C14:G14,\"X\",$C$12:$G$12)),(SUMIF(C14:G14,\"X\",$C$12:$G$12)), 1)","v":1}]
[null,{"$f":"User01!B15","v":"FASCINACIÓN"},null,null,null,null,null,1]
[null,{"$f":"User01!B16","v":"ABURRIMIENTO"},null,null,null,null,null,1]
[null,{"$f":"User01!B17","v":"ENFADO"},null,null,null,null,null,1]
[null,{"$f":"User01!B18","v":"TRISTEZA"},null,null,null,null,null,1]
[null,{"$f":"User01!B19","v":"VERGÜENZA"},null,null,null,null,null,1]
[null,{"$f":"User01!B20","v":"MIEDO"},null,null,null,null,null,1]
[null,{"$f":"User01!B21","v":"REPUGNANCIA"},null,null,null,null,null,1]
[null,{"$f":"User01!B22","v":"DESEO"},null,null,null,null,null,1]
[null,{"$f":"User01!B23","v":"ESPERANZA"},null,null,null,null,null,1]
[null,{"$f":"User01!B24","v":"ORGULLO"},null,null,null,null,null,1]
[]
[]
[]
[null,"EMOCIONES \\ INTENSIDAD","NADA","POCO","MEDIANAMENTE","BASTANTE","MUCHO","VALORACIÓN"]
[null,null,1.00000000001,2,3,4,5]
[null,{"$f":"$B13","v":"ALEGRÍA"},null,null,null,null,null,{"$f":"IF((SUMIF(C30:G30,\"X\",$C$29:$G$29)),(SUMIF(C30:G30,\"X\",$C$29:$G$29)), 1)","v":1}]
[null,"SATISFACCIÓN",null,null,null,null,null,{"$f":"IF((SUMIF(C31:G31,\"X\",$C$29:$G$29)),(SUMIF(C31:G31,\"X\",$C$29:$G$29)), 1)","v":1}]
[null,"FASCINACIÓN",null,null,null,null,null,1]
[null,"ABURRIMIENTO",null,null,null,null,null,1]
[null,"ENFADO",null,null,null,null,null,1]
[null,"TRISTEZA",null,null,null,null,null,1]
[null,"VERGÜENZA",null,null,null,null,null,1]
[null,"MIEDO",null,null,null,null,null,1]
[null,"REPUGNANCIA",null,null,null,null,null,1]
[null,"DESEO",null,null,null,null,null,1]
[null,"ESPERANZA",null,null,null,null,null,1]
[null,"ORGULLO",null,null,null,null,null,1]
[]
[]
[]
[null,"EMOCIONES \\ INTENSIDAD","NADA","POCO","MEDIANAMENTE","BASTANTE","MUCHO","VALORACIÓN"]
[null,null,1.00000000001,2,3,4,5]
[null,{"$f":"$B30","v":"ALEGRÍA"},null,null,null,null,null,{"$f":"IF((SUMIF(C47:G47,\"X\",$C$46:$G$46)),(SUMIF(C47:G47,\"X\",$C$46:$G$46)), 1)","v":1}]
[null,"SATISFACCIÓN",null,null,null,null,null,{"$f":"IF((SUMIF(C48:G48,\"X\",$C$46:$G$46)),(SUMIF(C48:G48,\"X\",$C$46:$G$46)), 1)","v":1}]
[null,"FASCINACIÓN",null,null,null,null,null,1]
[null,"ABURRIMIENTO",null,null,null,null,null,1]
[null,"ENFADO",null,null,null,null,null,1]
[null,"TRISTEZA",null,null,null,null,null,1]
[null,"VERGÜENZA",null,null,null,null,null,1]
[null,"MIEDO",null,null,null,null,null,1]
[null,"REPUGNANCIA",null,null,null,null,null,1]
[null,"DESEO",null,null,null,null,null,1]
[null,"ESPERANZA",null,null,null,null,null,1]
[null,"ORGULLO",null,null,null,null,null,1]
[]
[]
[]
[]
[null,"EMOCIONES \\ INTENSIDAD","NADA","POCO","MEDIANAMENTE","BASTANTE","MUCHO","VALORACIÓN"]
[null,null,1.00000000001,2,3,4,5]
[null,{"$f":"$B47","v":"ALEGRÍA"},null,null,null,null,null,{"$f":"IF((SUMIF(C65:G65,\"X\",$C$64:$G$64)),(SUMIF(C65:G65,\"X\",$C$64:$G$64)), 1)","v":1}]
[null,"SATISFACCIÓN",null,null,null,null,null,{"$f":"IF((SUMIF(C66:G66,\"X\",$C$64:$G$64)),(SUMIF(C66:G66,\"X\",$C$64:$G$64)), 1)","v":1}]
[null,"FASCINACIÓN",null,null,null,null,null,1]
[null,"ABURRIMIENTO",null,null,null,null,null,1]
[null,"ENFADO",null,null,null,null,null,1]
[null,"TRISTEZA",null,null,null,null,null,1]
[null,"VERGÜENZA",null,null,null,null,null,1]
[null,"MIEDO",null,null,null,null,null,1]
[null,"REPUGNANCIA",null,null,null,null,null,1]
[null,"DESEO",null,null,null,null,null,1]
[null,"ESPERANZA",null,null,null,null,null,1]
[null,"ORGULLO",null,null,null,null,null,1]
[]
[]
[]
[]
[null,"EMOCIONES \\ INTENSIDAD","NADA","POCO","MEDIANAMENTE","BASTANTE","MUCHO","VALORACIÓN"]
[null,null,1.00000000001,2,3,4,5]
[null,{"$f":"$B65","v":"ALEGRÍA"},null,null,null,null,null,{"$f":"IF((SUMIF(C83:G83,\"X\",$C$82:$G$82)),(SUMIF(C83:G83,\"X\",$C$82:$G$82)), 1)","v":1}]
[null,"SATISFACCIÓN",null,null,null,null,null,{"$f":"IF((SUMIF(C84:G84,\"X\",$C$82:$G$82)),(SUMIF(C84:G84,\"X\",$C$82:$G$82)), 1)","v":1}]
[null,"FASCINACIÓN",null,null,null,null,null,1]
[null,"ABURRIMIENTO",null,null,null,null,null,1]
[null,"ENFADO",null,null,null,null,null,1]
[null,"TRISTEZA",null,null,null,null,null,1]
[null,"VERGÜENZA",null,null,null,null,null,1]
[null,"MIEDO",null,null,null,null,null,1]
[null,"REPUGNANCIA",null,null,null,null,null,1]
[null,"DESEO",null,null,null,null,null,1]
[null,"ESPERANZA",null,null,null,null,null,1]
[null,"ORGULLO",null,null,null,null,null,1]
[]
[]
[]
[]
[null,"EMOCIONES \\ INTENSIDAD","NADA","POCO","MEDIANAMENTE","BASTANTE","MUCHO","VALORACIÓN"]
[null,null,1.00000000001,2,3,4,5]
[null,{"$f":"$B83","v":"ALEGRÍA"},null,null,null,null,null,{"$f":"IF((SUMIF(C101:G101,\"X\",$C$100:$G$100)),(SUMIF(C101:G101,\"X\",$C$100:$G$100)), 1)","v":1}]
[null,"SATISFACCIÓN",null,null,null,null,null,{"$f":"IF((SUMIF(C102:G102,\"X\",$C$100:$G$100)),(SUMIF(C102:G102,\"X\",$C$100:$G$100)), 1)","v":1}]
[null,"FASCINACIÓN",null,null,null,null,null,1]
[null,"ABURRIMIENTO",null,null,null,null,null,1]
[null,"ENFADO",null,null,null,null,null,1]
[null,"TRISTEZA",null,null,null,null,null,1]
[null,"VERGÜENZA",null,null,null,null,null,1]
[null,"MIEDO",null,null,null,null,null,1]
[null,"REPUGNANCIA",null,null,null,null,null,1]
[null,"DESEO",null,null,null,null,null,1]
[null,"ESPERANZA",null,null,null,null,null,1]
[null,"ORGULLO",null,null,null,null,null,1]

{"sheet":"User46","index":46,"n_rows":112,"n_cols":13,"rows_kept":112,"cut":false,"hidden":false,"merged":[[98,1,99,1],[98,7,99,7],[44,1,45,1],[44,7,45,7],[62,1,63,1],[62,7,63,7],[80,1,81,1],[80,7,81,7],[0,1,0,17],[2,13,5,17],[10,1,11,1],[10,7,11,7],[27,1,28,1],[27,7,28,7]]}
[null,"ESTAS TABLAS UTILIZAN MACROS DE EXCEL, POR LO TANTO CUANDO SE LE CONSULTE AL ABRIR EL ARCHIVO DEBE ACEPTAR Y HABILITAR LAS MACROS PARA QUE FUNCIONEN CORRECTAMENTE"]
[]
[null,"VALORACIÓN EMOCIONAL DE PRODUCTOS, MATERIALES O SERVICIOS",null,null,null,null,null,null,"GÉNERO:",null,"EDAD:",null,"OBS:"]
[]
[null,"DÍGANOS COMO SE SIENTE RESPECTO A CADA PRODUCTO, MATERIAL O SERVICIO"]
[null,"· ESCOJA ENTRE 3 Y 5 EMOCIONES QUE UD. EXPERIMENTE CON MAYOR INTENSIDAD"]
[null,"· MARQUE CON UNA X LAS EMOCIONES Y LOS NIVELES DE INTENSIDAD ESCOGIDOS"]
[null,"· MARQUE SUS PREFERENCIAS CON UN DOBLE CLIC EN LA CELDA ESCOGIDA (PUEDE BORRAR DEL MISMO MODO)"]
[]
[]
[null,"EMOCIONES \\ INTENSIDAD","NADA","POCO","MEDIANAMENTE","BASTANTE","MUCHO","VALORACIÓN"]
[null,null,1.00000000001,2,3,4,5]
[null,{"$f":"User01!B13","v":"ALEGRÍA"},null,null,null,null,null,{"$f":"IF((SUMIF(C13:G13,\"X\",$C$12:$G$12)),(SUMIF(C13:G13,\"X\",$C$12:$G$12)), 1)","v":1}]
[null,{"$f":"User01!B14","v":"SATISFACCIÓN"},null,null,null,null,null,{"$f":"IF((SUMIF(C14:G14,\"X\",$C$12:$G$12)),(SUMIF(C14:G14,\"X\",$C$12:$G$12)), 1)","v":1}]
[null,{"$f":"User01!B15","v":"FASCINACIÓN"},null,null,null,null,null,1]
[null,{"$f":"User01!B16","v":"ABURRIMIENTO"},null,null,null,null,null,1]
[null,{"$f":"User01!B17","v":"ENFADO"},null,null,null,null,null,1]
[null,{"$f":"User01!B18","v":"TRISTEZA"},null,null,null,null,null,1]
[null,{"$f":"User01!B19","v":"VERGÜENZA"},null,null,null,null,null,1]
[null,{"$f":"User01!B20","v":"MIEDO"},null,null,null,null,null,1]
[null,{"$f":"User01!B21","v":"REPUGNANCIA"},null,null,null,null,null,1]
[null,{"$f":"User01!B22","v":"DESEO"},null,null,null,null,null,1]
[null,{"$f":"User01!B23","v":"ESPERANZA"},null,null,null,null,null,1]
[null,{"$f":"User01!B24","v":"ORGULLO"},null,null,null,null,null,1]
[]
[]
[]
[null,"EMOCIONES \\ INTENSIDAD","NADA","POCO","MEDIANAMENTE","BASTANTE","MUCHO","VALORACIÓN"]
[null,null,1.00000000001,2,3,4,5]
[null,{"$f":"$B13","v":"ALEGRÍA"},null,null,null,null,null,{"$f":"IF((SUMIF(C30:G30,\"X\",$C$29:$G$29)),(SUMIF(C30:G30,\"X\",$C$29:$G$29)), 1)","v":1}]
[null,"SATISFACCIÓN",null,null,null,null,null,{"$f":"IF((SUMIF(C31:G31,\"X\",$C$29:$G$29)),(SUMIF(C31:G31,\"X\",$C$29:$G$29)), 1)","v":1}]
[null,"FASCINACIÓN",null,null,null,null,null,1]
[null,"ABURRIMIENTO",null,null,null,null,null,1]
[null,"ENFADO",null,null,null,null,null,1]
[null,"TRISTEZA",null,null,null,null,null,1]
[null,"VERGÜENZA",null,null,null,null,null,1]
[null,"MIEDO",null,null,null,null,null,1]
[null,"REPUGNANCIA",null,null,null,null,null,1]
[null,"DESEO",null,null,null,null,null,1]
[null,"ESPERANZA",null,null,null,null,null,1]
[null,"ORGULLO",null,null,null,null,null,1]
[]
[]
[]
[null,"EMOCIONES \\ INTENSIDAD","NADA","POCO","MEDIANAMENTE","BASTANTE","MUCHO","VALORACIÓN"]
[null,null,1.00000000001,2,3,4,5]
[null,{"$f":"$B30","v":"ALEGRÍA"},null,null,null,null,null,{"$f":"IF((SUMIF(C47:G47,\"X\",$C$46:$G$46)),(SUMIF(C47:G47,\"X\",$C$46:$G$46)), 1)","v":1}]
[null,"SATISFACCIÓN",null,null,null,null,null,{"$f":"IF((SUMIF(C48:G48,\"X\",$C$46:$G$46)),(SUMIF(C48:G48,\"X\",$C$46:$G$46)), 1)","v":1}]
[null,"FASCINACIÓN",null,null,null,null,null,1]
[null,"ABURRIMIENTO",null,null,null,null,null,1]
[null,"ENFADO",null,null,null,null,null,1]
[null,"TRISTEZA",null,null,null,null,null,1]
[null,"VERGÜENZA",null,null,null,null,null,1]
[null,"MIEDO",null,null,null,null,null,1]
[null,"REPUGNANCIA",null,null,null,null,null,1]
[null,"DESEO",null,null,null,null,null,1]
[null,"ESPERANZA",null,null,null,null,null,1]
[null,"ORGULLO",null,null,null,null,null,1]
[]
[]
[]
[]
[null,"EMOCIONES \\ INTENSIDAD","NADA","POCO","MEDIANAMENTE","BASTANTE","MUCHO","VALORACIÓN"]
[null,null,1.00000000001,2,3,4,5]
[null,{"$f":"$B47","v":"ALEGRÍA"},null,null,null,null,null,{"$f":"IF((SUMIF(C65:G65,\"X\",$C$64:$G$64)),(SUMIF(C65:G65,\"X\",$C$64:$G$64)), 1)","v":1}]
[null,"SATISFACCIÓN",null,null,null,null,null,{"$f":"IF((SUMIF(C66:G66,\"X\",$C$64:$G$64)),(SUMIF(C66:G66,\"X\",$C$64:$G$64)), 1)","v":1}]
[null,"FASCINACIÓN",null,null,null,null,null,1]
[null,"ABURRIMIENTO",null,null,null,null,null,1]
[null,"ENFADO",null,null,null,null,null,1]
[null,"TRISTEZA",null,null,null,null,null,1]
[null,"VERGÜENZA",null,null,null,null,null,1]
[null,"MIEDO",null,null,null,null,null,1]
[null,"REPUGNANCIA",null,null,null,null,null,1]
[null,"DESEO",null,null,null,null,null,1]
[null,"ESPERANZA",null,null,null,null,null,1]
[null,"ORGULLO",null,null,null,null,null,1]
[]
[]
[]
[]
[null,"EMOCIONES \\ INTENSIDAD","NADA","POCO","MEDIANAMENTE","BASTANTE","MUCHO","VALORACIÓN"]
[null,null,1.00000000001,2,3,4,5]
[null,{"$f":"$B65","v":"ALEGRÍA"},null,null,null,null,null,{"$f":"IF((SUMIF(C83:G83,\"X\",$C$82:$G$82)),(SUMIF(C83:G83,\"X\",$C$82:$G$82)), 1)","v":1}]
[null,"SATISFACCIÓN",null,null,null,null,null,{"$f":"IF((SUMIF(C84:G84,\"X\",$C$82:$G$82)),(SUMIF(C84:G84,\"X\",$C$82:$G$82)), 1)","v":1}]
[null,"FASCINACIÓN",null,null,null,null,null,1]
[null,"ABURRIMIENTO",null,null,null,null,null,1]
[null,"ENFADO",null,null,null,null,null,1]
[null,"TRISTEZA",null,null,null,null,null,1]
[null,"VERGÜENZA",null,null,null,null,null,1]
[null,"MIEDO",null,null,null,null,null,1]
[null,"REPUGNANCIA",null,null,null,null,null,1]
[null,"DESEO",null,null,null,null,null,1]
[null,"ESPERANZA",null,null,null,null,null,1]
[null,"ORGULLO",null,null,null,null,null,1]
[]
[]
[]
[]
[null,"EMOCIONES \\ INTENSIDAD","NADA","POCO","MEDIANAMENTE","BASTANTE","MUCHO","VALORACIÓN"]
[null,null,1.00000000001,2,3,4,5]
[null,{"$f":"$B83","v":"ALEGRÍA"},null,null,null,null,null,{"$f":"IF((SUMIF(C101:G101,\"X\",$C$100:$G$100)),(SUMIF(C101:G101,\"X\",$C$100:$G$100)), 1)","v":1}]
[null,"SATISFACCIÓN",null,null,null,null,null,{"$f":"IF((SUMIF(C102:G102,\"X\",$C$100:$G$100)),(SUMIF(C102:G102,\"X\",$C$100:$G$100)), 1)","v":1}]
[null,"FASCINACIÓN",null,null,null,null,null,1]
[null,"ABURRIMIENTO",null,null,null,null,null,1]
[null,"ENFADO",null,null,null,null,null,1]
[null,"TRISTEZA",null,null,null,null,null,1]
[null,"VERGÜENZA",null,null,null,null,null,1]
[null,"MIEDO",null,null,null,null,null,1]
[null,"REPUGNANCIA",null,null,null,null,null,1]
[null,"DESEO",null,null,null,null,null,1]
[null,"ESPERANZA",null,null,null,null,null,1]
[null,"ORGULLO",null,null,null,null,null,1]

{"sheet":"User47","index":47,"n_rows":112,"n_cols":13,"rows_kept":112,"cut":false,"hidden":false,"merged":[[98,1,99,1],[98,7,99,7],[44,1,45,1],[44,7,45,7],[62,1,63,1],[62,7,63,7],[80,1,81,1],[80,7,81,7],[0,1,0,17],[2,13,5,17],[10,1,11,1],[10,7,11,7],[27,1,28,1],[27,7,28,7]]}
[null,"ESTAS TABLAS UTILIZAN MACROS DE EXCEL, POR LO TANTO CUANDO SE LE CONSULTE AL ABRIR EL ARCHIVO DEBE ACEPTAR Y HABILITAR LAS MACROS PARA QUE FUNCIONEN CORRECTAMENTE"]
[]
[null,"VALORACIÓN EMOCIONAL DE PRODUCTOS, MATERIALES O SERVICIOS",null,null,null,null,null,null,"GÉNERO:",null,"EDAD:",null,"OBS:"]
[]
[null,"DÍGANOS COMO SE SIENTE RESPECTO A CADA PRODUCTO, MATERIAL O SERVICIO"]
[null,"· ESCOJA ENTRE 3 Y 5 EMOCIONES QUE UD. EXPERIMENTE CON MAYOR INTENSIDAD"]
[null,"· MARQUE CON UNA X LAS EMOCIONES Y LOS NIVELES DE INTENSIDAD ESCOGIDOS"]
[null,"· MARQUE SUS PREFERENCIAS CON UN DOBLE CLIC EN LA CELDA ESCOGIDA (PUEDE BORRAR DEL MISMO MODO)"]
[]
[]
[null,"EMOCIONES \\ INTENSIDAD","NADA","POCO","MEDIANAMENTE","BASTANTE","MUCHO","VALORACIÓN"]
[null,null,1.00000000001,2,3,4,5]
[null,{"$f":"User01!B13","v":"ALEGRÍA"},null,null,null,null,null,{"$f":"IF((SUMIF(C13:G13,\"X\",$C$12:$G$12)),(SUMIF(C13:G13,\"X\",$C$12:$G$12)), 1)","v":1}]
[null,{"$f":"User01!B14","v":"SATISFACCIÓN"},null,null,null,null,null,{"$f":"IF((SUMIF(C14:G14,\"X\",$C$12:$G$12)),(SUMIF(C14:G14,\"X\",$C$12:$G$12)), 1)","v":1}]
[null,{"$f":"User01!B15","v":"FASCINACIÓN"},null,null,null,null,null,1]
[null,{"$f":"User01!B16","v":"ABURRIMIENTO"},null,null,null,null,null,1]
[null,{"$f":"User01!B17","v":"ENFADO"},null,null,null,null,null,1]
[null,{"$f":"User01!B18","v":"TRISTEZA"},null,null,null,null,null,1]
[null,{"$f":"User01!B19","v":"VERGÜENZA"},null,null,null,null,null,1]
[null,{"$f":"User01!B20","v":"MIEDO"},null,null,null,null,null,1]
[null,{"$f":"User01!B21","v":"REPUGNANCIA"},null,null,null,null,null,1]
[null,{"$f":"User01!B22","v":"DESEO"},null,null,null,null,null,1]
[null,{"$f":"User01!B23","v":"ESPERANZA"},null,null,null,null,null,1]
[null,{"$f":"User01!B24","v":"ORGULLO"},null,null,null,null,null,1]
[]
[]
[]
[null,"EMOCIONES \\ INTENSIDAD","NADA","POCO","MEDIANAMENTE","BASTANTE","MUCHO","VALORACIÓN"]
[null,null,1.00000000001,2,3,4,5]
[null,{"$f":"$B13","v":"ALEGRÍA"},null,null,null,null,null,{"$f":"IF((SUMIF(C30:G30,\"X\",$C$29:$G$29)),(SUMIF(C30:G30,\"X\",$C$29:$G$29)), 1)","v":1}]
[null,"SATISFACCIÓN",null,null,null,null,null,{"$f":"IF((SUMIF(C31:G31,\"X\",$C$29:$G$29)),(SUMIF(C31:G31,\"X\",$C$29:$G$29)), 1)","v":1}]
[null,"FASCINACIÓN",null,null,null,null,null,1]
[null,"ABURRIMIENTO",null,null,null,null,null,1]
[null,"ENFADO",null,null,null,null,null,1]
[null,"TRISTEZA",null,null,null,null,null,1]
[null,"VERGÜENZA",null,null,null,null,null,1]
[null,"MIEDO",null,null,null,null,null,1]
[null,"REPUGNANCIA",null,null,null,null,null,1]
[null,"DESEO",null,null,null,null,null,1]
[null,"ESPERANZA",null,null,null,null,null,1]
[null,"ORGULLO",null,null,null,null,null,1]
[]
[]
[]
[null,"EMOCIONES \\ INTENSIDAD","NADA","POCO","MEDIANAMENTE","BASTANTE","MUCHO","VALORACIÓN"]
[null,null,1.00000000001,2,3,4,5]
[null,{"$f":"$B30","v":"ALEGRÍA"},null,null,null,null,null,{"$f":"IF((SUMIF(C47:G47,\"X\",$C$46:$G$46)),(SUMIF(C47:G47,\"X\",$C$46:$G$46)), 1)","v":1}]
[null,"SATISFACCIÓN",null,null,null,null,null,{"$f":"IF((SUMIF(C48:G48,\"X\",$C$46:$G$46)),(SUMIF(C48:G48,\"X\",$C$46:$G$46)), 1)","v":1}]
[null,"FASCINACIÓN",null,null,null,null,null,1]
[null,"ABURRIMIENTO",null,null,null,null,null,1]
[null,"ENFADO",null,null,null,null,null,1]
[null,"TRISTEZA",null,null,null,null,null,1]
[null,"VERGÜENZA",null,null,null,null,null,1]
[null,"MIEDO",null,null,null,null,null,1]
[null,"REPUGNANCIA",null,null,null,null,null,1]
[null,"DESEO",null,null,null,null,null,1]
[null,"ESPERANZA",null,null,null,null,null,1]
[null,"ORGULLO",null,null,null,null,null,1]
[]
[]
[]
[]
[null,"EMOCIONES \\ INTENSIDAD","NADA","POCO","MEDIANAMENTE","BASTANTE","MUCHO","VALORACIÓN"]
[null,null,1.00000000001,2,3,4,5]
[null,{"$f":"$B47","v":"ALEGRÍA"},null,null,null,null,null,{"$f":"IF((SUMIF(C65:G65,\"X\",$C$64:$G$64)),(SUMIF(C65:G65,\"X\",$C$64:$G$64)), 1)","v":1}]
[null,"SATISFACCIÓN",null,null,null,null,null,{"$f":"IF((SUMIF(C66:G66,\"X\",$C$64:$G$64)),(SUMIF(C66:G66,\"X\",$C$64:$G$64)), 1)","v":1}]
[null,"FASCINACIÓN",null,null,null,null,null,1]
[null,"ABURRIMIENTO",null,null,null,null,null,1]
[null,"ENFADO",null,null,null,null,null,1]
[null,"TRISTEZA",null,null,null,null,null,1]
[null,"VERGÜENZA",null,null,null,null,null,1]
[null,"MIEDO",null,null,null,null,null,1]
[null,"REPUGNANCIA",null,null,null,null,null,1]
[null,"DESEO",null,null,null,null,null,1]
[null,"ESPERANZA",null,null,null,null,null,1]
[null,"ORGULLO",null,null,null,null,null,1]
[]
[]
[]
[]
[null,"EMOCIONES \\ INTENSIDAD","NADA","POCO","MEDIANAMENTE","BASTANTE","MUCHO","VALORACIÓN"]
[null,null,1.00000000001,2,3,4,5]
[null,{"$f":"$B65","v":"ALEGRÍA"},null,null,null,null,null,{"$f":"IF((SUMIF(C83:G83,\"X\",$C$82:$G$82)),(SUMIF(C83:G83,\"X\",$C$82:$G$82)), 1)","v":1}]
[null,"SATISFACCIÓN",null,null,null,null,null,{"$f":"IF((SUMIF(C84:G84,\"X\",$C$82:$G$82)),(SUMIF(C84:G84,\"X\",$C$82:$G$82)), 1)","v":1}]
[null,"FASCINACIÓN",null,null,null,null,null,1]
[null,"ABURRIMIENTO",null,null,null,null,null,1]
[null,"ENFADO",null,null,null,null,null,1]
[null,"TRISTEZA",null,null,null,null,null,1]
[null,"VERGÜENZA",null,null,null,null,null,1]
[null,"MIEDO",null,null,null,null,null,1]
[null,"REPUGNANCIA",null,null,null,null,null,1]
[null,"DESEO",null,null,null,null,null,1]
[null,"ESPERANZA",null,null,null,null,null,1]
[null,"ORGULLO",null,null,null,null,null,1]
[]
[]
[]
[]
[null,"EMOCIONES \\ INTENSIDAD","NADA","POCO","MEDIANAMENTE","BASTANTE","MUCHO","VALORACIÓN"]
[null,null,1.00000000001,2,3,4,5]
[null,{"$f":"$B83","v":"ALEGRÍA"},null,null,null,null,null,{"$f":"IF((SUMIF(C101:G101,\"X\",$C$100:$G$100)),(SUMIF(C101:G101,\"X\",$C$100:$G$100)), 1)","v":1}]
[null,"SATISFACCIÓN",null,null,null,null,null,{"$f":"IF((SUMIF(C102:G102,\"X\",$C$100:$G$100)),(SUMIF(C102:G102,\"X\",$C$100:$G$100)), 1)","v":1}]
[null,"FASCINACIÓN",null,null,null,null,null,1]
[null,"ABURRIMIENTO",null,null,null,null,null,1]
[null,"ENFADO",null,null,null,null,null,1]
[null,"TRISTEZA",null,null,null,null,null,1]
[null,"VERGÜENZA",null,null,null,null,null,1]
[null,"MIEDO",null,null,null,null,null,1]
[null,"REPUGNANCIA",null,null,null,null,null,1]
[null,"DESEO",null,null,null,null,null,1]
[null,"ESPERANZA",null,null,null,null,null,1]
[null,"ORGULLO",null,null,null,null,null,1]

{"sheet":"User48","index":48,"n_rows":112,"n_cols":13,"rows_kept":112,"cut":false,"hidden":false,"merged":[[98,1,99,1],[98,7,99,7],[44,1,45,1],[44,7,45,7],[62,1,63,1],[62,7,63,7],[80,1,81,1],[80,7,81,7],[0,1,0,17],[2,13,5,17],[10,1,11,1],[10,7,11,7],[27,1,28,1],[27,7,28,7]]}
[null,"ESTAS TABLAS UTILIZAN MACROS DE EXCEL, POR LO TANTO CUANDO SE LE CONSULTE AL ABRIR EL ARCHIVO DEBE ACEPTAR Y HABILITAR LAS MACROS PARA QUE FUNCIONEN CORRECTAMENTE"]
[]
[null,"VALORACIÓN EMOCIONAL DE PRODUCTOS, MATERIALES O SERVICIOS",null,null,null,null,null,null,"GÉNERO:",null,"EDAD:",null,"OBS:"]
[]
[null,"DÍGANOS COMO SE SIENTE RESPECTO A CADA PRODUCTO, MATERIAL O SERVICIO"]
[null,"· ESCOJA ENTRE 3 Y 5 EMOCIONES QUE UD. EXPERIMENTE CON MAYOR INTENSIDAD"]
[null,"· MARQUE CON UNA X LAS EMOCIONES Y LOS NIVELES DE INTENSIDAD ESCOGIDOS"]
[null,"· MARQUE SUS PREFERENCIAS CON UN DOBLE CLIC EN LA CELDA ESCOGIDA (PUEDE BORRAR DEL MISMO MODO)"]
[]
[]
[null,"EMOCIONES \\ INTENSIDAD","NADA","POCO","MEDIANAMENTE","BASTANTE","MUCHO","VALORACIÓN"]
[null,null,1.00000000001,2,3,4,5]
[null,{"$f":"User01!B13","v":"ALEGRÍA"},null,null,null,null,null,{"$f":"IF((SUMIF(C13:G13,\"X\",$C$12:$G$12)),(SUMIF(C13:G13,\"X\",$C$12:$G$12)), 1)","v":1}]
[null,{"$f":"User01!B14","v":"SATISFACCIÓN"},null,null,null,null,null,{"$f":"IF((SUMIF(C14:G14,\"X\",$C$12:$G$12)),(SUMIF(C14:G14,\"X\",$C$12:$G$12)), 1)","v":1}]
[null,{"$f":"User01!B15","v":"FASCINACIÓN"},null,null,null,null,null,1]
[null,{"$f":"User01!B16","v":"ABURRIMIENTO"},null,null,null,null,null,1]
[null,{"$f":"User01!B17","v":"ENFADO"},null,null,null,null,null,1]
[null,{"$f":"User01!B18","v":"TRISTEZA"},null,null,null,null,null,1]
[null,{"$f":"User01!B19","v":"VERGÜENZA"},null,null,null,null,null,1]
[null,{"$f":"User01!B20","v":"MIEDO"},null,null,null,null,null,1]
[null,{"$f":"User01!B21","v":"REPUGNANCIA"},null,null,null,null,null,1]
[null,{"$f":"User01!B22","v":"DESEO"},null,null,null,null,null,1]
[null,{"$f":"User01!B23","v":"ESPERANZA"},null,null,null,null,null,1]
[null,{"$f":"User01!B24","v":"ORGULLO"},null,null,null,null,null,1]
[]
[]
[]
[null,"EMOCIONES \\ INTENSIDAD","NADA","POCO","MEDIANAMENTE","BASTANTE","MUCHO","VALORACIÓN"]
[null,null,1.00000000001,2,3,4,5]
[null,{"$f":"$B13","v":"ALEGRÍA"},null,null,null,null,null,{"$f":"IF((SUMIF(C30:G30,\"X\",$C$29:$G$29)),(SUMIF(C30:G30,\"X\",$C$29:$G$29)), 1)","v":1}]
[null,"SATISFACCIÓN",null,null,null,null,null,{"$f":"IF((SUMIF(C31:G31,\"X\",$C$29:$G$29)),(SUMIF(C31:G31,\"X\",$C$29:$G$29)), 1)","v":1}]
[null,"FASCINACIÓN",null,null,null,null,null,1]
[null,"ABURRIMIENTO",null,null,null,null,null,1]
[null,"ENFADO",null,null,null,null,null,1]
[null,"TRISTEZA",null,null,null,null,null,1]
[null,"VERGÜENZA",null,null,null,null,null,1]
[null,"MIEDO",null,null,null,null,null,1]
[null,"REPUGNANCIA",null,null,null,null,null,1]
[null,"DESEO",null,null,null,null,null,1]
[null,"ESPERANZA",null,null,null,null,null,1]
[null,"ORGULLO",null,null,null,null,null,1]
[]
[]
[]
[null,"EMOCIONES \\ INTENSIDAD","NADA","POCO","MEDIANAMENTE","BASTANTE","MUCHO","VALORACIÓN"]
[null,null,1.00000000001,2,3,4,5]
[null,{"$f":"$B30","v":"ALEGRÍA"},null,null,null,null,null,{"$f":"IF((SUMIF(C47:G47,\"X\",$C$46:$G$46)),(SUMIF(C47:G47,\"X\",$C$46:$G$46)), 1)","v":1}]
[null,"SATISFACCIÓN",null,null,null,null,null,{"$f":"IF((SUMIF(C48:G48,\"X\",$C$46:$G$46)),(SUMIF(C48:G48,\"X\",$C$46:$G$46)), 1)","v":1}]
[null,"FASCINACIÓN",null,null,null,null,null,1]
[null,"ABURRIMIENTO",null,null,null,null,null,1]
[null,"ENFADO",null,null,null,null,null,1]
[null,"TRISTEZA",null,null,null,null,null,1]
[null,"VERGÜENZA",null,null,null,null,null,1]
[null,"MIEDO",null,null,null,null,null,1]
[null,"REPUGNANCIA",null,null,null,null,null,1]
[null,"DESEO",null,null,null,null,null,1]
[null,"ESPERANZA",null,null,null,null,null,1]
[null,"ORGULLO",null,null,null,null,null,1]
[]
[]
[]
[]
[null,"EMOCIONES \\ INTENSIDAD","NADA","POCO","MEDIANAMENTE","BASTANTE","MUCHO","VALORACIÓN"]
[null,null,1.00000000001,2,3,4,5]
[null,{"$f":"$B47","v":"ALEGRÍA"},null,null,null,null,null,{"$f":"IF((SUMIF(C65:G65,\"X\",$C$64:$G$64)),(SUMIF(C65:G65,\"X\",$C$64:$G$64)), 1)","v":1}]
[null,"SATISFACCIÓN",null,null,null,null,null,{"$f":"IF((SUMIF(C66:G66,\"X\",$C$64:$G$64)),(SUMIF(C66:G66,\"X\",$C$64:$G$64)), 1)","v":1}]
[null,"FASCINACIÓN",null,null,null,null,null,1]
[null,"ABURRIMIENTO",null,null,null,null,null,1]
[null,"ENFADO",null,null,null,null,null,1]
[null,"TRISTEZA",null,null,null,null,null,1]
[null,"VERGÜENZA",null,null,null,null,null,1]
[null,"MIEDO",null,null,null,null,null,1]
[null,"REPUGNANCIA",null,null,null,null,null,1]
[null,"DESEO",null,null,null,null,null,1]
[null,"ESPERANZA",null,null,null,null,null,1]
[null,"ORGULLO",null,null,null,null,null,1]
[]
[]
[]
[]
[null,"EMOCIONES \\ INTENSIDAD","NADA","POCO","MEDIANAMENTE","BASTANTE","MUCHO","VALORACIÓN"]
[null,null,1.00000000001,2,3,4,5]
[null,{"$f":"$B65","v":"ALEGRÍA"},null,null,null,null,null,{"$f":"IF((SUMIF(C83:G83,\"X\",$C$82:$G$82)),(SUMIF(C83:G83,\"X\",$C$82:$G$82)), 1)","v":1}]
[null,"SATISFACCIÓN",null,null,null,null,null,{"$f":"IF((SUMIF(C84:G84,\"X\",$C$82:$G$82)),(SUMIF(C84:G84,\"X\",$C$82:$G$82)), 1)","v":1}]
[null,"FASCINACIÓN",null,null,null,null,null,1]
[null,"ABURRIMIENTO",null,null,null,null,null,1]
[null,"ENFADO",null,null,null,null,null,1]
[null,"TRISTEZA",null,null,null,null,null,1]
[null,"VERGÜENZA",null,null,null,null,null,1]
[null,"MIEDO",null,null,null,null,null,1]
[null,"REPUGNANCIA",null,null,null,null,null,1]
[null,"DESEO",null,null,null,null,null,1]
[null,"ESPERANZA",null,null,null,null,null,1]
[null,"ORGULLO",null,null,null,null,null,1]
[]
[]
[]
[]
[null,"EMOCIONES \\ INTENSIDAD","NADA","POCO","MEDIANAMENTE","BASTANTE","MUCHO","VALORACIÓN"]
[null,null,1.00000000001,2,3,4,5]
[null,{"$f":"$B83","v":"ALEGRÍA"},null,null,null,null,null,{"$f":"IF((SUMIF(C101:G101,\"X\",$C$100:$G$100)),(SUMIF(C101:G101,\"X\",$C$100:$G$100)), 1)","v":1}]
[null,"SATISFACCIÓN",null,null,null,null,null,{"$f":"IF((SUMIF(C102:G102,\"X\",$C$100:$G$100)),(SUMIF(C102:G102,\"X\",$C$100:$G$100)), 1)","v":1}]
[null,"FASCINACIÓN",null,null,null,null,null,1]
[null,"ABURRIMIENTO",null,null,null,null,null,1]
[null,"ENFADO",null,null,null,null,null,1]
[null,"TRISTEZA",null,null,null,null,null,1]
[null,"VERGÜENZA",null,null,null,null,null,1]
[null,"MIEDO",null,null,null,null,null,1]
[null,"REPUGNANCIA",null,null,null,null,null,1]
[null,"DESEO",null,null,null,null,null,1]
[null,"ESPERANZA",null,null,null,null,null,1]
[null,"ORGULLO",null,null,null,null,null,1]

{"sheet":"User49","index":49,"n_rows":112,"n_cols":13,"rows_kept":112,"cut":false,"hidden":false,"merged":[[98,1,99,1],[98,7,99,7],[44,1,45,1],[44,7,45,7],[62,1,63,1],[62,7,63,7],[80,1,81,1],[80,7,81,7],[0,1,0,17],[2,13,5,17],[10,1,11,1],[10,7,11,7],[27,1,28,1],[27,7,28,7]]}
[null,"ESTAS TABLAS UTILIZAN MACROS DE EXCEL, POR LO TANTO CUANDO SE LE CONSULTE AL ABRIR EL ARCHIVO DEBE ACEPTAR Y HABILITAR LAS MACROS PARA QUE FUNCIONEN CORRECTAMENTE"]
[]
[null,"VALORACIÓN EMOCIONAL DE PRODUCTOS, MATERIALES O SERVICIOS",null,null,null,null,null,null,"GÉNERO:",null,"EDAD:",null,"OBS:"]
[]
[null,"DÍGANOS COMO SE SIENTE RESPECTO A CADA PRODUCTO, MATERIAL O SERVICIO"]
[null,"· ESCOJA ENTRE 3 Y 5 EMOCIONES QUE UD. EXPERIMENTE CON MAYOR INTENSIDAD"]
[null,"· MARQUE CON UNA X LAS EMOCIONES Y LOS NIVELES DE INTENSIDAD ESCOGIDOS"]
[null,"· MARQUE SUS PREFERENCIAS CON UN DOBLE CLIC EN LA CELDA ESCOGIDA (PUEDE BORRAR DEL MISMO MODO)"]
[]
[]
[null,"EMOCIONES \\ INTENSIDAD","NADA","POCO","MEDIANAMENTE","BASTANTE","MUCHO","VALORACIÓN"]
[null,null,1.00000000001,2,3,4,5]
[null,{"$f":"User01!B13","v":"ALEGRÍA"},null,null,null,null,null,{"$f":"IF((SUMIF(C13:G13,\"X\",$C$12:$G$12)),(SUMIF(C13:G13,\"X\",$C$12:$G$12)), 1)","v":1}]
[null,{"$f":"User01!B14","v":"SATISFACCIÓN"},null,null,null,null,null,{"$f":"IF((SUMIF(C14:G14,\"X\",$C$12:$G$12)),(SUMIF(C14:G14,\"X\",$C$12:$G$12)), 1)","v":1}]
[null,{"$f":"User01!B15","v":"FASCINACIÓN"},null,null,null,null,null,1]
[null,{"$f":"User01!B16","v":"ABURRIMIENTO"},null,null,null,null,null,1]
[null,{"$f":"User01!B17","v":"ENFADO"},null,null,null,null,null,1]
[null,{"$f":"User01!B18","v":"TRISTEZA"},null,null,null,null,null,1]
[null,{"$f":"User01!B19","v":"VERGÜENZA"},null,null,null,null,null,1]
[null,{"$f":"User01!B20","v":"MIEDO"},null,null,null,null,null,1]
[null,{"$f":"User01!B21","v":"REPUGNANCIA"},null,null,null,null,null,1]
[null,{"$f":"User01!B22","v":"DESEO"},null,null,null,null,null,1]
[null,{"$f":"User01!B23","v":"ESPERANZA"},null,null,null,null,null,1]
[null,{"$f":"User01!B24","v":"ORGULLO"},null,null,null,null,null,1]
[]
[]
[]
[null,"EMOCIONES \\ INTENSIDAD","NADA","POCO","MEDIANAMENTE","BASTANTE","MUCHO","VALORACIÓN"]
[null,null,1.00000000001,2,3,4,5]
[null,{"$f":"$B13","v":"ALEGRÍA"},null,null,null,null,null,{"$f":"IF((SUMIF(C30:G30,\"X\",$C$29:$G$29)),(SUMIF(C30:G30,\"X\",$C$29:$G$29)), 1)","v":1}]
[null,"SATISFACCIÓN",null,null,null,null,null,{"$f":"IF((SUMIF(C31:G31,\"X\",$C$29:$G$29)),(SUMIF(C31:G31,\"X\",$C$29:$G$29)), 1)","v":1}]
[null,"FASCINACIÓN",null,null,null,null,null,1]
[null,"ABURRIMIENTO",null,null,null,null,null,1]
[null,"ENFADO",null,null,null,null,null,1]
[null,"TRISTEZA",null,null,null,null,null,1]
[null,"VERGÜENZA",null,null,null,null,null,1]
[null,"MIEDO",null,null,null,null,null,1]
[null,"REPUGNANCIA",null,null,null,null,null,1]
[null,"DESEO",null,null,null,null,null,1]
[null,"ESPERANZA",null,null,null,null,null,1]
[null,"ORGULLO",null,null,null,null,null,1]
[]
[]
[]
[null,"EMOCIONES \\ INTENSIDAD","NADA","POCO","MEDIANAMENTE","BASTANTE","MUCHO","VALORACIÓN"]
[null,null,1.00000000001,2,3,4,5]
[null,{"$f":"$B30","v":"ALEGRÍA"},null,null,null,null,null,{"$f":"IF((SUMIF(C47:G47,\"X\",$C$46:$G$46)),(SUMIF(C47:G47,\"X\",$C$46:$G$46)), 1)","v":1}]
[null,"SATISFACCIÓN",null,null,null,null,null,{"$f":"IF((SUMIF(C48:G48,\"X\",$C$46:$G$46)),(SUMIF(C48:G48,\"X\",$C$46:$G$46)), 1)","v":1}]
[null,"FASCINACIÓN",null,null,null,null,null,1]
[null,"ABURRIMIENTO",null,null,null,null,null,1]
[null,"ENFADO",null,null,null,null,null,1]
[null,"TRISTEZA",null,null,null,null,null,1]
[null,"VERGÜENZA",null,null,null,null,null,1]
[null,"MIEDO",null,null,null,null,null,1]
[null,"REPUGNANCIA",null,null,null,null,null,1]
[null,"DESEO",null,null,null,null,null,1]
[null,"ESPERANZA",null,null,null,null,null,1]
[null,"ORGULLO",null,null,null,null,null,1]
[]
[]
[]
[]
[null,"EMOCIONES \\ INTENSIDAD","NADA","POCO","MEDIANAMENTE","BASTANTE","MUCHO","VALORACIÓN"]
[null,null,1.00000000001,2,3,4,5]
[null,{"$f":"$B47","v":"ALEGRÍA"},null,null,null,null,null,{"$f":"IF((SUMIF(C65:G65,\"X\",$C$64:$G$64)),(SUMIF(C65:G65,\"X\",$C$64:$G$64)), 1)","v":1}]
[null,"SATISFACCIÓN",null,null,null,null,null,{"$f":"IF((SUMIF(C66:G66,\"X\",$C$64:$G$64)),(SUMIF(C66:G66,\"X\",$C$64:$G$64)), 1)","v":1}]
[null,"FASCINACIÓN",null,null,null,null,null,1]
[null,"ABURRIMIENTO",null,null,null,null,null,1]
[null,"ENFADO",null,null,null,null,null,1]
[null,"TRISTEZA",null,null,null,null,null,1]
[null,"VERGÜENZA",null,null,null,null,null,1]
[null,"MIEDO",null,null,null,null,null,1]
[null,"REPUGNANCIA",null,null,null,null,null,1]
[null,"DESEO",null,null,null,null,null,1]
[null,"ESPERANZA",null,null,null,null,null,1]
[null,"ORGULLO",null,null,null,null,null,1]
[]
[]
[]
[]
[null,"EMOCIONES \\ INTENSIDAD","NADA","POCO","MEDIANAMENTE","BASTANTE","MUCHO","VALORACIÓN"]
[null,null,1.00000000001,2,3,4,5]
[null,{"$f":"$B65","v":"ALEGRÍA"},null,null,null,null,null,{"$f":"IF((SUMIF(C83:G83,\"X\",$C$82:$G$82)),(SUMIF(C83:G83,\"X\",$C$82:$G$82)), 1)","v":1}]
[null,"SATISFACCIÓN",null,null,null,null,null,{"$f":"IF((SUMIF(C84:G84,\"X\",$C$82:$G$82)),(SUMIF(C84:G84,\"X\",$C$82:$G$82)), 1)","v":1}]
[null,"FASCINACIÓN",null,null,null,null,null,1]
[null,"ABURRIMIENTO",null,null,null,null,null,1]
[null,"ENFADO",null,null,null,null,null,1]
[null,"TRISTEZA",null,null,null,null,null,1]
[null,"VERGÜENZA",null,null,null,null,null,1]
[null,"MIEDO",null,null,null,null,null,1]
[null,"REPUGNANCIA",null,null,null,null,null,1]
[null,"DESEO",null,null,null,null,null,1]
[null,"ESPERANZA",null,null,null,null,null,1]
[null,"ORGULLO",null,null,null,null,null,1]
[]
[]
[]
[]
[null,"EMOCIONES \\ INTENSIDAD","NADA","POCO","MEDIANAMENTE","BASTANTE","MUCHO","VALORACIÓN"]
[null,null,1.00000000001,2,3,4,5]
[null,{"$f":"$B83","v":"ALEGRÍA"},null,null,null,null,null,{"$f":"IF((SUMIF(C101:G101,\"X\",$C$100:$G$100)),(SUMIF(C101:G101,\"X\",$C$100:$G$100)), 1)","v":1}]
[null,"SATISFACCIÓN",null,null,null,null,null,{"$f":"IF((SUMIF(C102:G102,\"X\",$C$100:$G$100)),(SUMIF(C102:G102,\"X\",$C$100:$G$100)), 1)","v":1}]
[null,"FASCINACIÓN",null,null,null,null,null,1]
[null,"ABURRIMIENTO",null,null,null,null,null,1]
[null,"ENFADO",null,null,null,null,null,1]
[null,"TRISTEZA",null,null,null,null,null,1]
[null,"VERGÜENZA",null,null,null,null,null,1]
[null,"MIEDO",null,null,null,null,null,1]
[null,"REPUGNANCIA",null,null,null,null,null,1]
[null,"DESEO",null,null,null,null,null,1]
[null,"ESPERANZA",null,null,null,null,null,1]
[null,"ORGULLO",null,null,null,null,null,1]

{"sheet":"User50","index":50,"n_rows":112,"n_cols":13,"rows_kept":112,"cut":false,"hidden":false,"merged":[[98,1,99,1],[98,7,99,7],[44,1,45,1],[44,7,45,7],[62,1,63,1],[62,7,63,7],[80,1,81,1],[80,7,81,7],[0,1,0,17],[2,13,5,17],[10,1,11,1],[10,7,11,7],[27,1,28,1],[27,7,28,7]]}
[null,"ESTAS TABLAS UTILIZAN MACROS DE EXCEL, POR LO TANTO CUANDO SE LE CONSULTE AL ABRIR EL ARCHIVO DEBE ACEPTAR Y HABILITAR LAS MACROS PARA QUE FUNCIONEN CORRECTAMENTE"]
[]
[null,"VALORACIÓN EMOCIONAL DE PRODUCTOS, MATERIALES O SERVICIOS",null,null,null,null,null,null,"GÉNERO:",null,"EDAD:",null,"OBS:"]
[]
[null,"DÍGANOS COMO SE SIENTE RESPECTO A CADA PRODUCTO, MATERIAL O SERVICIO"]
[null,"· ESCOJA ENTRE 3 Y 5 EMOCIONES QUE UD. EXPERIMENTE CON MAYOR INTENSIDAD"]
[null,"· MARQUE CON UNA X LAS EMOCIONES Y LOS NIVELES DE INTENSIDAD ESCOGIDOS"]
[null,"· MARQUE SUS PREFERENCIAS CON UN DOBLE CLIC EN LA CELDA ESCOGIDA (PUEDE BORRAR DEL MISMO MODO)"]
[]
[]
[null,"EMOCIONES \\ INTENSIDAD","NADA","POCO","MEDIANAMENTE","BASTANTE","MUCHO","VALORACIÓN"]
[null,null,1.00000000001,2,3,4,5]
[null,{"$f":"User01!B13","v":"ALEGRÍA"},null,null,null,null,null,{"$f":"IF((SUMIF(C13:G13,\"X\",$C$12:$G$12)),(SUMIF(C13:G13,\"X\",$C$12:$G$12)), 1)","v":1}]
[null,{"$f":"User01!B14","v":"SATISFACCIÓN"},null,null,null,null,null,{"$f":"IF((SUMIF(C14:G14,\"X\",$C$12:$G$12)),(SUMIF(C14:G14,\"X\",$C$12:$G$12)), 1)","v":1}]
[null,{"$f":"User01!B15","v":"FASCINACIÓN"},null,null,null,null,null,1]
[null,{"$f":"User01!B16","v":"ABURRIMIENTO"},null,null,null,null,null,1]
[null,{"$f":"User01!B17","v":"ENFADO"},null,null,null,null,null,1]
[null,{"$f":"User01!B18","v":"TRISTEZA"},null,null,null,null,null,1]
[null,{"$f":"User01!B19","v":"VERGÜENZA"},null,null,null,null,null,1]
[null,{"$f":"User01!B20","v":"MIEDO"},null,null,null,null,null,1]
[null,{"$f":"User01!B21","v":"REPUGNANCIA"},null,null,null,null,null,1]
[null,{"$f":"User01!B22","v":"DESEO"},null,null,null,null,null,1]
[null,{"$f":"User01!B23","v":"ESPERANZA"},null,null,null,null,null,1]
[null,{"$f":"User01!B24","v":"ORGULLO"},null,null,null,null,null,1]
[]
[]
[]
[null,"EMOCIONES \\ INTENSIDAD","NADA","POCO","MEDIANAMENTE","BASTANTE","MUCHO","VALORACIÓN"]
[null,null,1.00000000001,2,3,4,5]
[null,{"$f":"$B13","v":"ALEGRÍA"},null,null,null,null,null,{"$f":"IF((SUMIF(C30:G30,\"X\",$C$29:$G$29)),(SUMIF(C30:G30,\"X\",$C$29:$G$29)), 1)","v":1}]
[null,"SATISFACCIÓN",null,null,null,null,null,{"$f":"IF((SUMIF(C31:G31,\"X\",$C$29:$G$29)),(SUMIF(C31:G31,\"X\",$C$29:$G$29)), 1)","v":1}]
[null,"FASCINACIÓN",null,null,null,null,null,1]
[null,"ABURRIMIENTO",null,null,null,null,null,1]
[null,"ENFADO",null,null,null,null,null,1]
[null,"TRISTEZA",null,null,null,null,null,1]
[null,"VERGÜENZA",null,null,null,null,null,1]
[null,"MIEDO",null,null,null,null,null,1]
[null,"REPUGNANCIA",null,null,null,null,null,1]
[null,"DESEO",null,null,null,null,null,1]
[null,"ESPERANZA",null,null,null,null,null,1]
[null,"ORGULLO",null,null,null,null,null,1]
[]
[]
[]
[null,"EMOCIONES \\ INTENSIDAD","NADA","POCO","MEDIANAMENTE","BASTANTE","MUCHO","VALORACIÓN"]
[null,null,1.00000000001,2,3,4,5]
[null,{"$f":"$B30","v":"ALEGRÍA"},null,null,null,null,null,{"$f":"IF((SUMIF(C47:G47,\"X\",$C$46:$G$46)),(SUMIF(C47:G47,\"X\",$C$46:$G$46)), 1)","v":1}]
[null,"SATISFACCIÓN",null,null,null,null,null,{"$f":"IF((SUMIF(C48:G48,\"X\",$C$46:$G$46)),(SUMIF(C48:G48,\"X\",$C$46:$G$46)), 1)","v":1}]
[null,"FASCINACIÓN",null,null,null,null,null,1]
[null,"ABURRIMIENTO",null,null,null,null,null,1]
[null,"ENFADO",null,null,null,null,null,1]
[null,"TRISTEZA",null,null,null,null,null,1]
[null,"VERGÜENZA",null,null,null,null,null,1]
[null,"MIEDO",null,null,null,null,null,1]
[null,"REPUGNANCIA",null,null,null,null,null,1]
[null,"DESEO",null,null,null,null,null,1]
[null,"ESPERANZA",null,null,null,null,null,1]
[null,"ORGULLO",null,null,null,null,null,1]
[]
[]
[]
[]
[null,"EMOCIONES \\ INTENSIDAD","NADA","POCO","MEDIANAMENTE","BASTANTE","MUCHO","VALORACIÓN"]
[null,null,1.00000000001,2,3,4,5]
[null,{"$f":"$B47","v":"ALEGRÍA"},null,null,null,null,null,{"$f":"IF((SUMIF(C65:G65,\"X\",$C$64:$G$64)),(SUMIF(C65:G65,\"X\",$C$64:$G$64)), 1)","v":1}]
[null,"SATISFACCIÓN",null,null,null,null,null,{"$f":"IF((SUMIF(C66:G66,\"X\",$C$64:$G$64)),(SUMIF(C66:G66,\"X\",$C$64:$G$64)), 1)","v":1}]
[null,"FASCINACIÓN",null,null,null,null,null,1]
[null,"ABURRIMIENTO",null,null,null,null,null,1]
[null,"ENFADO",null,null,null,null,null,1]
[null,"TRISTEZA",null,null,null,null,null,1]
[null,"VERGÜENZA",null,null,null,null,null,1]
[null,"MIEDO",null,null,null,null,null,1]
[null,"REPUGNANCIA",null,null,null,null,null,1]
[null,"DESEO",null,null,null,null,null,1]
[null,"ESPERANZA",null,null,null,null,null,1]
[null,"ORGULLO",null,null,null,null,null,1]
[]
[]
[]
[]
[null,"EMOCIONES \\ INTENSIDAD","NADA","POCO","MEDIANAMENTE","BASTANTE","MUCHO","VALORACIÓN"]
[null,null,1.00000000001,2,3,4,5]
[null,{"$f":"$B65","v":"ALEGRÍA"},null,null,null,null,null,{"$f":"IF((SUMIF(C83:G83,\"X\",$C$82:$G$82)),(SUMIF(C83:G83,\"X\",$C$82:$G$82)), 1)","v":1}]
[null,"SATISFACCIÓN",null,null,null,null,null,{"$f":"IF((SUMIF(C84:G84,\"X\",$C$82:$G$82)),(SUMIF(C84:G84,\"X\",$C$82:$G$82)), 1)","v":1}]
[null,"FASCINACIÓN",null,null,null,null,null,1]
[null,"ABURRIMIENTO",null,null,null,null,null,1]
[null,"ENFADO",null,null,null,null,null,1]
[null,"TRISTEZA",null,null,null,null,null,1]
[null,"VERGÜENZA",null,null,null,null,null,1]
[null,"MIEDO",null,null,null,null,null,1]
[null,"REPUGNANCIA",null,null,null,null,null,1]
[null,"DESEO",null,null,null,null,null,1]
[null,"ESPERANZA",null,null,null,null,null,1]
[null,"ORGULLO",null,null,null,null,null,1]
[]
[]
[]
[]
[null,"EMOCIONES \\ INTENSIDAD","NADA","POCO","MEDIANAMENTE","BASTANTE","MUCHO","VALORACIÓN"]
[null,null,1.00000000001,2,3,4,5]
[null,{"$f":"$B83","v":"ALEGRÍA"},null,null,null,null,null,{"$f":"IF((SUMIF(C101:G101,\"X\",$C$100:$G$100)),(SUMIF(C101:G101,\"X\",$C$100:$G$100)), 1)","v":1}]
[null,"SATISFACCIÓN",null,null,null,null,null,{"$f":"IF((SUMIF(C102:G102,\"X\",$C$100:$G$100)),(SUMIF(C102:G102,\"X\",$C$100:$G$100)), 1)","v":1}]
[null,"FASCINACIÓN",null,null,null,null,null,1]
[null,"ABURRIMIENTO",null,null,null,null,null,1]
[null,"ENFADO",null,null,null,null,null,1]
[null,"TRISTEZA",null,null,null,null,null,1]
[null,"VERGÜENZA",null,null,null,null,null,1]
[null,"MIEDO",null,null,null,null,null,1]
[null,"REPUGNANCIA",null,null,null,null,null,1]
[null,"DESEO",null,null,null,null,null,1]
[null,"ESPERANZA",null,null,null,null,null,1]
[null,"ORGULLO",null,null,null,null,null,1]

{"sheet":"ItemA","index":51,"n_rows":18,"n_cols":65,"rows_kept":18,"cut":false,"hidden":false,"merged":[[1,42,2,42],[1,43,2,43],[1,44,2,44],[1,37,2,37],[1,38,2,38],[1,39,2,39],[1,40,2,40],[1,41,2,41],[1,32,2,32],[1,33,2,33],[1,34,2,34],[1,35,2,35],[1,36,2,36],[1,45,2,45],[1,46,2,46],[1,47,2,47],[1,48,2,48],[1,55,2,55],[1,53,2,53],[1,54,2,54],[1,49,2,49],[1,50,2,50],[1,51,2,51],[1,62,2,62],[1,63,2,63],[1,60,2,60],[1,57,2,57],[1,58,2,58],[1,59,2,59],[1,23,2,23],[1,24,2,24],[1,13,2,13],[1,14,2,14],[1,15,2,15],[1,17,2,17],[1,22,2,22],[1,19,2,19],[1,20,2,20],[1,21,2,21],[1,1,2,1],[1,16,2,16],[1,18,2,18],[1,6,2,6],[1,8,2,8],[1,9,2,9],[1,10,2,10],[1,11,2,11],[1,3,2,3],[1,4,2,4],[1,2,2,2],[1,7,2,7],[1,12,2,12],[1,5,2,5],[1,31,2,31],[1,25,2,25],[1,26,2,26],[1,28,2,28],[1,29,2,29],[1,30,2,30],[1,27,2,27]]}
[]
[null,"EMOCIONES/USUARIOS",1,2,3,4,5,6,7,8,9,10,11,12,13,14,15,16,17,18,19,20,21,22,23,24,25,26,27,28,29,30,31,32,33,34,35,36,37,38,39,40,41,42,43,44,45,46,47,48,49,50,null,"FRECUENCIA","% DE MENCIÓN","JERARQUÍA FRECUENCIA (MEDIA)",null,"MEDIA DE INTENSIDAD","DESVIACION ESTÁNDAR","MEDIANA DE INTENSIDAD","JERARQUÍA INTENSIDAD (MEDIA)",null,"POSITIVAS","NEGATIVAS"]
[]
[null,{"$f":"User01!B13","v":"ALEGRÍA"},{"$f":"User01!H13","v":1},{"$f":"User02!$H13","v":1},{"$f":"User03!$H13","v":1},{"$f":"User04!$H13","v":1},{"$f":"User05!$H13","v":1},{"$f":"User06!$H13","v":1},{"$f":"User07!$H13","v":1},{"$f":"User08!$H13","v":1},{"$f":"User09!$H13","v":1},{"$f":"User10!$H13","v":1},{"$f":"User11!$H13","v":1},{"$f":"User12!$H13","v":1},{"$f":"User13!$H13","v":1},{"$f":"User14!$H13","v":1},{"$f":"User15!$H13","v":1},{"$f":"User16!$H13","v":1},{"$f":"User17!$H13","v":1},{"$f":"User18!$H13","v":1},{"$f":"User19!$H13","v":1},{"$f":"User20!$H13","v":1},{"$f":"User21!$H13","v":1},{"$f":"User22!$H13","v":1},{"$f":"User23!$H13","v":1},{"$f":"User24!$H13","v":1},{"$f":"User25!$H13","v":1},{"$f":"User26!$H13","v":1},{"$f":"User27!$H13","v":1},{"$f":"User28!$H13","v":1},{"$f":"User29!$H13","v":1},{"$f":"User30!$H13","v":1},{"$f":"User31!$H13","v":1},{"$f":"User32!$H13","v":1},{"$f":"User33!$H13","v":1},{"$f":"User34!$H13","v":1},{"$f":"User35!$H13","v":1},{"$f":"User36!$H13","v":1},{"$f":"User37!$H13","v":1},{"$f":"User38!$H13","v":1},{"$f":"User39!$H13","v":1},{"$f":"User40!$H13","v":1},{"$f":"User41!$H13","v":1},{"$f":"User42!$H13","v":1},{"$f":"User43!$H13","v":1},{"$f":"User44!$H13","v":1},{"$f":"User45!$H13","v":1},{"$f":"User46!$H13","v":1},{"$f":"User47!$H13","v":1},{"$f":"User48!$H13","v":1},{"$f":"User49!$H13","v":1},{"$f":"User50!$H13","v":1},null,{"$f":"COUNTIF(C4:AZ4, \"<>1\")","v":0},{"$f":"IFERROR(BB4*100/SUM(BB4:BB15), 0)","v":0},{"$f":"IF((BB4>0),RANK(BB4,BB4:BB15,0),\"SIN RANGO\")","v":"SIN RANGO"},null,{"$f":"IFERROR(AVERAGEIF(C4:AZ4, \">1\"), 1)","v":1},{"$f":"IFERROR(STDEV(IF(C4:AZ4<>1, C4:AZ4, \"\")), 0)","v":0},{"$f":"IFERROR(MEDIAN(IF(C4:AZ4<>1, C4:AZ4, \"\")), 1)","v":1},{"$f":"IF((BF4>1),RANK(BF4,$BF$4:$BF$15,0),\"SIN RANGO\")","v":"SIN RANGO"},null,{"$f":"BB4","v":0}]
[null,{"$f":"User01!B14","v":"SATISFACCIÓN"},{"$f":"User01!H14","v":1},{"$f":"User02!H14","v":1},{"$f":"User03!$H14","v":1},{"$f":"User04!$H14","v":1},{"$f":"User05!$H14","v":1},{"$f":"User06!$H14","v":1},{"$f":"User07!$H14","v":1},{"$f":"User08!$H14","v":1},{"$f":"User09!$H14","v":1},{"$f":"User10!$H14","v":1},{"$f":"User11!$H14","v":1},{"$f":"User12!$H14","v":1},{"$f":"User13!$H14","v":1},{"$f":"User14!$H14","v":1},{"$f":"User15!$H14","v":1},{"$f":"User16!$H14","v":1},{"$f":"User17!$H14","v":1},{"$f":"User18!$H14","v":1},{"$f":"User19!$H14","v":1},{"$f":"User20!$H14","v":1},{"$f":"User21!$H14","v":1},{"$f":"User22!$H14","v":1},{"$f":"User23!$H14","v":1},{"$f":"User24!$H14","v":1},{"$f":"User25!$H14","v":1},{"$f":"User26!$H14","v":1},{"$f":"User27!$H14","v":1},{"$f":"User28!$H14","v":1},{"$f":"User29!$H14","v":1},{"$f":"User30!$H14","v":1},{"$f":"User31!$H14","v":1},{"$f":"User32!$H14","v":1},{"$f":"User33!$H14","v":1},{"$f":"User34!$H14","v":1},{"$f":"User35!$H14","v":1},{"$f":"User36!$H14","v":1},{"$f":"User37!$H14","v":1},{"$f":"User38!$H14","v":1},{"$f":"User39!$H14","v":1},{"$f":"User40!$H14","v":1},{"$f":"User41!$H14","v":1},{"$f":"User42!$H14","v":1},{"$f":"User43!$H14","v":1},{"$f":"User44!$H14","v":1},{"$f":"User45!$H14","v":1},{"$f":"User46!$H14","v":1},{"$f":"User47!$H14","v":1},{"$f":"User48!$H14","v":1},{"$f":"User49!$H14","v":1},{"$f":"User50!$H14","v":1},null,{"$f":"COUNTIF(C5:AZ5, \"<>1\")","v":0},{"$f":"IFERROR(BB5*100/SUM(BB4:BB15), 0)","v":0},{"$f":"IF((BB5>0),RANK(BB5,BB4:BB15,0),\"SIN RANGO\")","v":"SIN RANGO"},null,{"$f":"IFERROR(AVERAGEIF(C5:AZ5, \">1\"), 1)","v":1},{"$f":"IFERROR(STDEV(IF(C5:AZ5<>1, C5:AZ5, \"\")), 0)","v":0},{"$f":"IFERROR(MEDIAN(IF(C5:AZ5<>1, C5:AZ5, \"\")), 1)","v":1},{"$f":"IF((BF5>1),RANK(BF5,$BF$4:$BF$15,0),\"SIN RANGO\")","v":"SIN RANGO"},null,{"$f":"BB5","v":0}]
[null,{"$f":"User01!B15","v":"FASCINACIÓN"},{"$f":"User01!H15","v":1},{"$f":"User02!H15","v":1},{"$f":"User03!$H15","v":1},{"$f":"User04!$H15","v":1},{"$f":"User05!$H15","v":1},{"$f":"User06!$H15","v":1},{"$f":"User07!$H15","v":1},{"$f":"User08!$H15","v":1},{"$f":"User09!$H15","v":1},{"$f":"User10!$H15","v":1},{"$f":"User11!$H15","v":1},{"$f":"User12!$H15","v":1},{"$f":"User13!$H15","v":1},{"$f":"User14!$H15","v":1},{"$f":"User15!$H15","v":1},{"$f":"User16!$H15","v":1},{"$f":"User17!$H15","v":1},{"$f":"User18!$H15","v":1},{"$f":"User19!$H15","v":1},{"$f":"User20!$H15","v":1},{"$f":"User21!$H15","v":1},{"$f":"User22!$H15","v":1},{"$f":"User23!$H15","v":1},{"$f":"User24!$H15","v":1},{"$f":"User25!$H15","v":1},{"$f":"User26!$H15","v":1},{"$f":"User27!$H15","v":1},{"$f":"User28!$H15","v":1},{"$f":"User29!$H15","v":1},{"$f":"User30!$H15","v":1},{"$f":"User31!$H15","v":1},{"$f":"User32!$H15","v":1},{"$f":"User33!$H15","v":1},{"$f":"User34!$H15","v":1},{"$f":"User35!$H15","v":1},{"$f":"User36!$H15","v":1},{"$f":"User37!$H15","v":1},{"$f":"User38!$H15","v":1},{"$f":"User39!$H15","v":1},{"$f":"User40!$H15","v":1},{"$f":"User41!$H15","v":1},{"$f":"User42!$H15","v":1},{"$f":"User43!$H15","v":1},{"$f":"User44!$H15","v":1},{"$f":"User45!$H15","v":1},{"$f":"User46!$H15","v":1},{"$f":"User47!$H15","v":1},{"$f":"User48!$H15","v":1},{"$f":"User49!$H15","v":1},{"$f":"User50!$H15","v":1},null,0,{"$f":"IFERROR(BB6*100/SUM(BB4:BB15), 0)","v":0},{"$f":"IF((BB6>0),RANK(BB6,BB4:BB15,0),\"SIN RANGO\")","v":"SIN RANGO"},null,1,{"$f":"IFERROR(STDEV(IF(C6:AZ6<>1, C6:AZ6, \"\")), 0)","v":0},{"$f":"IFERROR(MEDIAN(IF(C6:AZ6<>1, C6:AZ6, \"\")), 1)","v":1},"SIN RANGO",null,0]
[null,{"$f":"User01!B16","v":"ABURRIMIENTO"},{"$f":"User01!H16","v":1},{"$f":"User02!H16","v":1},{"$f":"User03!$H16","v":1},{"$f":"User04!$H16","v":1},{"$f":"User05!$H16","v":1},{"$f":"User06!$H16","v":1},{"$f":"User07!$H16","v":1},{"$f":"User08!$H16","v":1},{"$f":"User09!$H16","v":1},{"$f":"User10!$H16","v":1},{"$f":"User11!$H16","v":1},{"$f":"User12!$H16","v":1},{"$f":"User13!$H16","v":1},{"$f":"User14!$H16","v":1},{"$f":"User15!$H16","v":1},{"$f":"User16!$H16","v":1},{"$f":"User17!$H16","v":1},{"$f":"User18!$H16","v":1},{"$f":"User19!$H16","v":1},{"$f":"User20!$H16","v":1},{"$f":"User21!$H16","v":1},{"$f":"User22!$H16","v":1},{"$f":"User23!$H16","v":1},{"$f":"User24!$H16","v":1},{"$f":"User25!$H16","v":1},{"$f":"User26!$H16","v":1},{"$f":"User27!$H16","v":1},{"$f":"User28!$H16","v":1},{"$f":"User29!$H16","v":1},{"$f":"User30!$H16","v":1},{"$f":"User31!$H16","v":1},{"$f":"User32!$H16","v":1},{"$f":"User33!$H16","v":1},{"$f":"User34!$H16","v":1},{"$f":"User35!$H16","v":1},{"$f":"User36!$H16","v":1},{"$f":"User37!$H16","v":1},{"$f":"User38!$H16","v":1},{"$f":"User39!$H16","v":1},{"$f":"User40!$H16","v":1},{"$f":"User41!$H16","v":1},{"$f":"User42!$H16","v":1},{"$f":"User43!$H16","v":1},{"$f":"User44!$H16","v":1},{"$f":"User45!$H16","v":1},{"$f":"User46!$H16","v":1},{"$f":"User47!$H16","v":1},{"$f":"User48!$H16","v":1},{"$f":"User49!$H16","v":1},{"$f":"User50!$H16","v":1},null,0,{"$f":"IFERROR(BB7*100/SUM(BB4:BB15), 0)","v":0},{"$f":"IF((BB7>0),RANK(BB7,BB4:BB15,0),\"SIN RANGO\")","v":"SIN RANGO"},null,1,{"$f":"IFERROR(STDEV(IF(C7:AZ7<>1, C7:AZ7, \"\")), 0)","v":0},{"$f":"IFERROR(MEDIAN(IF(C7:AZ7<>1, C7:AZ7, \"\")), 1)","v":1},"SIN RANGO",null,null,{"$f":"BB7:BB12","v":0}]
[null,{"$f":"User01!B17","v":"ENFADO"},{"$f":"User01!H17","v":1},{"$f":"User02!H17","v":1},{"$f":"User03!$H17","v":1},{"$f":"User04!$H17","v":1},{"$f":"User05!$H17","v":1},{"$f":"User06!$H17","v":1},{"$f":"User07!$H17","v":1},{"$f":"User08!$H17","v":1},{"$f":"User09!$H17","v":1},{"$f":"User10!$H17","v":1},{"$f":"User11!$H17","v":1},{"$f":"User12!$H17","v":1},{"$f":"User13!$H17","v":1},{"$f":"User14!$H17","v":1},{"$f":"User15!$H17","v":1},{"$f":"User16!$H17","v":1},{"$f":"User17!$H17","v":1},{"$f":"User18!$H17","v":1},{"$f":"User19!$H17","v":1},{"$f":"User20!$H17","v":1},{"$f":"User21!$H17","v":1},{"$f":"User22!$H17","v":1},{"$f":"User23!$H17","v":1},{"$f":"User24!$H17","v":1},{"$f":"User25!$H17","v":1},{"$f":"User26!$H17","v":1},{"$f":"User27!$H17","v":1},{"$f":"User28!$H17","v":1},{"$f":"User29!$H17","v":1},{"$f":"User30!$H17","v":1},{"$f":"User31!$H17","v":1},{"$f":"User32!$H17","v":1},{"$f":"User33!$H17","v":1},{"$f":"User34!$H17","v":1},{"$f":"User35!$H17","v":1},{"$f":"User36!$H17","v":1},{"$f":"User37!$H17","v":1},{"$f":"User38!$H17","v":1},{"$f":"User39!$H17","v":1},{"$f":"User40!$H17","v":1},{"$f":"User41!$H17","v":1},{"$f":"User42!$H17","v":1},{"$f":"User43!$H17","v":1},{"$f":"User44!$H17","v":1},{"$f":"User45!$H17","v":1},{"$f":"User46!$H17","v":1},{"$f":"User47!$H17","v":1},{"$f":"User48!$H17","v":1},{"$f":"User49!$H17","v":1},{"$f":"User50!$H17","v":1},null,0,{"$f":"IFERROR(BB8*100/SUM(BB4:BB15), 0)","v":0},{"$f":"IF((BB8>0),RANK(BB8,BB4:BB15,0),\"SIN RANGO\")","v":"SIN RANGO"},null,1,{"$f":"IFERROR(STDEV(IF(C8:AZ8<>1, C8:AZ8, \"\")), 0)","v":0},{"$f":"IFERROR(MEDIAN(IF(C8:AZ8<>1, C8:AZ8, \"\")), 1)","v":1},"SIN RANGO",null,null,{"$f":"BB8:BB13","v":0}]
[null,{"$f":"User01!B18","v":"TRISTEZA"},{"$f":"User01!H18","v":1},{"$f":"User02!H18","v":1},{"$f":"User03!$H18","v":1},{"$f":"User04!$H18","v":1},{"$f":"User05!$H18","v":1},{"$f":"User06!$H18","v":1},{"$f":"User07!$H18","v":1},{"$f":"User08!$H18","v":1},{"$f":"User09!$H18","v":1},{"$f":"User10!$H18","v":1},{"$f":"User11!$H18","v":1},{"$f":"User12!$H18","v":1},{"$f":"User13!$H18","v":1},{"$f":"User14!$H18","v":1},{"$f":"User15!$H18","v":1},{"$f":"User16!$H18","v":1},{"$f":"User17!$H18","v":1},{"$f":"User18!$H18","v":1},{"$f":"User19!$H18","v":1},{"$f":"User20!$H18","v":1},{"$f":"User21!$H18","v":1},{"$f":"User22!$H18","v":1},{"$f":"User23!$H18","v":1},{"$f":"User24!$H18","v":1},{"$f":"User25!$H18","v":1},{"$f":"User26!$H18","v":1},{"$f":"User27!$H18","v":1},{"$f":"User28!$H18","v":1},{"$f":"User29!$H18","v":1},{"$f":"User30!$H18","v":1},{"$f":"User31!$H18","v":1},{"$f":"User32!$H18","v":1},{"$f":"User33!$H18","v":1},{"$f":"User34!$H18","v":1},{"$f":"User35!$H18","v":1},{"$f":"User36!$H18","v":1},{"$f":"User37!$H18","v":1},{"$f":"User38!$H18","v":1},{"$f":"User39!$H18","v":1},{"$f":"User40!$H18","v":1},{"$f":"User41!$H18","v":1},{"$f":"User42!$H18","v":1},{"$f":"User43!$H18","v":1},{"$f":"User44!$H18","v":1},{"$f":"User45!$H18","v":1},{"$f":"User46!$H18","v":1},{"$f":"User47!$H18","v":1},{"$f":"User48!$H18","v":1},{"$f":"User49!$H18","v":1},{"$f":"User50!$H18","v":1},null,0,{"$f":"IFERROR(BB9*100/SUM(BB4:BB15), 0)","v":0},{"$f":"IF((BB9>0),RANK(BB9,BB4:BB15,0),\"SIN RANGO\")","v":"SIN RANGO"},null,1,{"$f":"IFERROR(STDEV(IF(C9:AZ9<>1, C9:AZ9, \"\")), 0)","v":0},{"$f":"IFERROR(MEDIAN(IF(C9:AZ9<>1, C9:AZ9, \"\")), 1)","v":1},"SIN RANGO",null,null,0]
[null,{"$f":"User01!B19","v":"VERGÜENZA"},{"$f":"User01!H19","v":1},{"$f":"User02!H19","v":1},{"$f":"User03!$H19","v":1},{"$f":"User04!$H19","v":1},{"$f":"User05!$H19","v":1},{"$f":"User06!$H19","v":1},{"$f":"User07!$H19","v":1},{"$f":"User08!$H19","v":1},{"$f":"User09!$H19","v":1},{"$f":"User10!$H19","v":1},{"$f":"User11!$H19","v":1},{"$f":"User12!$H19","v":1},{"$f":"User13!$H19","v":1},{"$f":"User14!$H19","v":1},{"$f":"User15!$H19","v":1},{"$f":"User16!$H19","v":1},{"$f":"User17!$H19","v":1},{"$f":"User18!$H19","v":1},{"$f":"User19!$H19","v":1},{"$f":"User20!$H19","v":1},{"$f":"User21!$H19","v":1},{"$f":"User22!$H19","v":1},{"$f":"User23!$H19","v":1},{"$f":"User24!$H19","v":1},{"$f":"User25!$H19","v":1},{"$f":"User26!$H19","v":1},{"$f":"User27!$H19","v":1},{"$f":"User28!$H19","v":1},{"$f":"User29!$H19","v":1},{"$f":"User30!$H19","v":1},{"$f":"User31!$H19","v":1},{"$f":"User32!$H19","v":1},{"$f":"User33!$H19","v":1},{"$f":"User34!$H19","v":1},{"$f":"User35!$H19","v":1},{"$f":"User36!$H19","v":1},{"$f":"User37!$H19","v":1},{"$f":"User38!$H19","v":1},{"$f":"User39!$H19","v":1},{"$f":"User40!$H19","v":1},{"$f":"User41!$H19","v":1},{"$f":"User42!$H19","v":1},{"$f":"User43!$H19","v":1},{"$f":"User44!$H19","v":1},{"$f":"User45!$H19","v":1},{"$f":"User46!$H19","v":1},{"$f":"User47!$H19","v":1},{"$f":"User48!$H19","v":1},{"$f":"User49!$H19","v":1},{"$f":"User50!$H19","v":1},null,0,{"$f":"IFERROR(BB10*100/SUM(BB4:BB15), 0)","v":0},{"$f":"IF((BB10>0),RANK(BB10,BB4:BB15,0),\"SIN RANGO\")","v":"SIN RANGO"},null,1,{"$f":"IFERROR(STDEV(IF(C10:AZ10<>1, C10:AZ10, \"\")), 0)","v":0},{"$f":"IFERROR(MEDIAN(IF(C10:AZ10<>1, C10:AZ10, \"\")), 1)","v":1},"SIN RANGO",null,null,{"$f":"BB10:BB15","v":0}]
[null,{"$f":"User01!B20","v":"MIEDO"},{"$f":"User01!H20","v":1},{"$f":"User02!H20","v":1},{"$f":"User03!$H20","v":1},{"$f":"User04!$H20","v":1},{"$f":"User05!$H20","v":1},{"$f":"User06!$H20","v":1},{"$f":"User07!$H20","v":1},{"$f":"User08!$H20","v":1},{"$f":"User09!$H20","v":1},{"$f":"User10!$H20","v":1},{"$f":"User11!$H20","v":1},{"$f":"User12!$H20","v":1},{"$f":"User13!$H20","v":1},{"$f":"User14!$H20","v":1},{"$f":"User15!$H20","v":1},{"$f":"User16!$H20","v":1},{"$f":"User17!$H20","v":1},{"$f":"User18!$H20","v":1},{"$f":"User19!$H20","v":1},{"$f":"User20!$H20","v":1},{"$f":"User21!$H20","v":1},{"$f":"User22!$H20","v":1},{"$f":"User23!$H20","v":1},{"$f":"User24!$H20","v":1},{"$f":"User25!$H20","v":1},{"$f":"User26!$H20","v":1},{"$f":"User27!$H20","v":1},{"$f":"User28!$H20","v":1},{"$f":"User29!$H20","v":1},{"$f":"User30!$H20","v":1},{"$f":"User31!$H20","v":1},{"$f":"User32!$H20","v":1},{"$f":"User33!$H20","v":1},{"$f":"User34!$H20","v":1},{"$f":"User35!$H20","v":1},{"$f":"User36!$H20","v":1},{"$f":"User37!$H20","v":1},{"$f":"User38!$H20","v":1},{"$f":"User39!$H20","v":1},{"$f":"User40!$H20","v":1},{"$f":"User41!$H20","v":1},{"$f":"User42!$H20","v":1},{"$f":"User43!$H20","v":1},{"$f":"User44!$H20","v":1},{"$f":"User45!$H20","v":1},{"$f":"User46!$H20","v":1},{"$f":"User47!$H20","v":1},{"$f":"User48!$H20","v":1},{"$f":"User49!$H20","v":1},{"$f":"User50!$H20","v":1},null,0,{"$f":"IFERROR(BB11*100/SUM(BB4:BB15), 0)","v":0},{"$f":"IF((BB11>0),RANK(BB11,BB4:BB15,0),\"SIN RANGO\")","v":"SIN RANGO"},null,1,{"$f":"IFERROR(STDEV(IF(C11:AZ11<>1, C11:AZ11, \"\")), 0)","v":0},{"$f":"IFERROR(MEDIAN(IF(C11:AZ11<>1, C11:AZ11, \"\")), 1)","v":1},"SIN RANGO",null,null,{"$f":"BB11:BB17","v":0}]
[null,{"$f":"User01!B21","v":"REPUGNANCIA"},{"$f":"User01!H21","v":1},{"$f":"User02!H21","v":1},{"$f":"User03!$H21","v":1},{"$f":"User04!$H21","v":1},{"$f":"User05!$H21","v":1},{"$f":"User06!$H21","v":1},{"$f":"User07!$H21","v":1},{"$f":"User08!$H21","v":1},{"$f":"User09!$H21","v":1},{"$f":"User10!$H21","v":1},{"$f":"User11!$H21","v":1},{"$f":"User12!$H21","v":1},{"$f":"User13!$H21","v":1},{"$f":"User14!$H21","v":1},{"$f":"User15!$H21","v":1},{"$f":"User16!$H21","v":1},{"$f":"User17!$H21","v":1},{"$f":"User18!$H21","v":1},{"$f":"User19!$H21","v":1},{"$f":"User20!$H21","v":1},{"$f":"User21!$H21","v":1},{"$f":"User22!$H21","v":1},{"$f":"User23!$H21","v":1},{"$f":"User24!$H21","v":1},{"$f":"User25!$H21","v":1},{"$f":"User26!$H21","v":1},{"$f":"User27!$H21","v":1},{"$f":"User28!$H21","v":1},{"$f":"User29!$H21","v":1},{"$f":"User30!$H21","v":1},{"$f":"User31!$H21","v":1},{"$f":"User32!$H21","v":1},{"$f":"User33!$H21","v":1},{"$f":"User34!$H21","v":1},{"$f":"User35!$H21","v":1},{"$f":"User36!$H21","v":1},{"$f":"User37!$H21","v":1},{"$f":"User38!$H21","v":1},{"$f":"User39!$H21","v":1},{"$f":"User40!$H21","v":1},{"$f":"User41!$H21","v":1},{"$f":"User42!$H21","v":1},{"$f":"User43!$H21","v":1},{"$f":"User44!$H21","v":1},{"$f":"User45!$H21","v":1},{"$f":"User46!$H21","v":1},{"$f":"User47!$H21","v":1},{"$f":"User48!$H21","v":1},{"$f":"User49!$H21","v":1},{"$f":"User50!$H21","v":1},null,0,{"$f":"IFERROR(BB12*100/SUM(BB4:BB15), 0)","v":0},{"$f":"IF((BB12>0),RANK(BB12,BB4:BB15,0),\"SIN RANGO\")","v":"SIN RANGO"},null,1,{"$f":"IFERROR(STDEV(IF(C12:AZ12<>1, C12:AZ12, \"\")), 0)","v":0},{"$f":"IFERROR(MEDIAN(IF(C12:AZ12<>1, C12:AZ12, \"\")), 1)","v":1},"SIN RANGO",null,null,{"$f":"BB12:BB18","v":0}]
[null,{"$f":"User01!B22","v":"DESEO"},{"$f":"User01!H22","v":1},{"$f":"User02!H22","v":1},{"$f":"User03!$H22","v":1},{"$f":"User04!$H22","v":1},{"$f":"User05!$H22","v":1},{"$f":"User06!$H22","v":1},{"$f":"User07!$H22","v":1},{"$f":"User08!$H22","v":1},{"$f":"User09!$H22","v":1},{"$f":"User10!$H22","v":1},{"$f":"User11!$H22","v":1},{"$f":"User12!$H22","v":1},{"$f":"User13!$H22","v":1},{"$f":"User14!$H22","v":1},{"$f":"User15!$H22","v":1},{"$f":"User16!$H22","v":1},{"$f":"User17!$H22","v":1},{"$f":"User18!$H22","v":1},{"$f":"User19!$H22","v":1},{"$f":"User20!$H22","v":1},{"$f":"User21!$H22","v":1},{"$f":"User22!$H22","v":1},{"$f":"User23!$H22","v":1},{"$f":"User24!$H22","v":1},{"$f":"User25!$H22","v":1},{"$f":"User26!$H22","v":1},{"$f":"User27!$H22","v":1},{"$f":"User28!$H22","v":1},{"$f":"User29!$H22","v":1},{"$f":"User30!$H22","v":1},{"$f":"User31!$H22","v":1},{"$f":"User32!$H22","v":1},{"$f":"User33!$H22","v":1},{"$f":"User34!$H22","v":1},{"$f":"User35!$H22","v":1},{"$f":"User36!$H22","v":1},{"$f":"User37!$H22","v":1},{"$f":"User38!$H22","v":1},{"$f":"User39!$H22","v":1},{"$f":"User40!$H22","v":1},{"$f":"User41!$H22","v":1},{"$f":"User42!$H22","v":1},{"$f":"User43!$H22","v":1},{"$f":"User44!$H22","v":1},{"$f":"User45!$H22","v":1},{"$f":"User46!$H22","v":1},{"$f":"User47!$H22","v":1},{"$f":"User48!$H22","v":1},{"$f":"User49!$H22","v":1},{"$f":"User50!$H22","v":1},null,0,{"$f":"IFERROR(BB13*100/SUM(BB4:BB15), 0)","v":0},{"$f":"IF((BB13>0),RANK(BB13,BB4:BB15,0),\"SIN RANGO\")","v":"SIN RANGO"},null,1,{"$f":"IFERROR(STDEV(IF(C13:AZ13<>1, C13:AZ13, \"\")), 0)","v":0},{"$f":"IFERROR(MEDIAN(IF(C13:AZ13<>1, C13:AZ13, \"\")), 1)","v":1},"SIN RANGO",null,{"$f":"BB13","v":0}]
[null,{"$f":"User01!B23","v":"ESPERANZA"},{"$f":"User01!H23","v":1},{"$f":"User02!H23","v":1},{"$f":"User03!$H23","v":1},{"$f":"User04!$H23","v":1},{"$f":"User05!$H23","v":1},{"$f":"User06!$H23","v":1},{"$f":"User07!$H23","v":1},{"$f":"User08!$H23","v":1},{"$f":"User09!$H23","v":1},{"$f":"User10!$H23","v":1},{"$f":"User11!$H23","v":1},{"$f":"User12!$H23","v":1},{"$f":"User13!$H23","v":1},{"$f":"User14!$H23","v":1},{"$f":"User15!$H23","v":1},{"$f":"User16!$H23","v":1},{"$f":"User17!$H23","v":1},{"$f":"User18!$H23","v":1},{"$f":"User19!$H23","v":1},{"$f":"User20!$H23","v":1},{"$f":"User21!$H23","v":1},{"$f":"User22!$H23","v":1},{"$f":"User23!$H23","v":1},{"$f":"User24!$H23","v":1},{"$f":"User25!$H23","v":1},{"$f":"User26!$H23","v":1},{"$f":"User27!$H23","v":1},{"$f":"User28!$H23","v":1},{"$f":"User29!$H23","v":1},{"$f":"User30!$H23","v":1},{"$f":"User31!$H23","v":1},{"$f":"User32!$H23","v":1},{"$f":"User33!$H23","v":1},{"$f":"User34!$H23","v":1},{"$f":"User35!$H23","v":1},{"$f":"User36!$H23","v":1},{"$f":"User37!$H23","v":1},{"$f":"User38!$H23","v":1},{"$f":"User39!$H23","v":1},{"$f":"User40!$H23","v":1},{"$f":"User41!$H23","v":1},{"$f":"User42!$H23","v":1},{"$f":"User43!$H23","v":1},{"$f":"User44!$H23","v":1},{"$f":"User45!$H23","v":1},{"$f":"User46!$H23","v":1},{"$f":"User47!$H23","v":1},{"$f":"User48!$H23","v":1},{"$f":"User49!$H23","v":1},{"$f":"User50!$H23","v":1},null,0,{"$f":"IFERROR(BB14*100/SUM(BB4:BB15), 0)","v":0},{"$f":"IF((BB14>0),RANK(BB14,BB4:BB15,0),\"SIN RANGO\")","v":"SIN RANGO"},null,1,{"$f":"IFERROR(STDEV(IF(C14:AZ14<>1, C14:AZ14, \"\")), 0)","v":0},{"$f":"IFERROR(MEDIAN(IF(C14:AZ14<>1, C14:AZ14, \"\")), 1)","v":1},"SIN RANGO",null,{"$f":"BB14","v":0}]
[null,{"$f":"User01!B24","v":"ORGULLO"},{"$f":"User01!H24","v":1},{"$f":"User02!H24","v":1},{"$f":"User03!$H24","v":1},{"$f":"User04!$H24","v":1},{"$f":"User05!$H24","v":1},{"$f":"User06!$H24","v":1},{"$f":"User07!$H24","v":1},{"$f":"User08!$H24","v":1},{"$f":"User09!$H24","v":1},{"$f":"User10!$H24","v":1},{"$f":"User11!$H24","v":1},{"$f":"User12!$H24","v":1},{"$f":"User13!$H24","v":1},{"$f":"User14!$H24","v":1},{"$f":"User15!$H24","v":1},{"$f":"User16!$H24","v":1},{"$f":"User17!$H24","v":1},{"$f":"User18!$H24","v":1},{"$f":"User19!$H24","v":1},{"$f":"User20!$H24","v":1},{"$f":"User21!$H24","v":1},{"$f":"User22!$H24","v":1},{"$f":"User23!$H24","v":1},{"$f":"User24!$H24","v":1},{"$f":"User25!$H24","v":1},{"$f":"User26!$H24","v":1},{"$f":"User27!$H24","v":1},{"$f":"User28!$H24","v":1},{"$f":"User29!$H24","v":1},{"$f":"User30!$H24","v":1},{"$f":"User31!$H24","v":1},{"$f":"User32!$H24","v":1},{"$f":"User33!$H24","v":1},{"$f":"User34!$H24","v":1},{"$f":"User35!$H24","v":1},{"$f":"User36!$H24","v":1},{"$f":"User37!$H24","v":1},{"$f":"User38!$H24","v":1},{"$f":"User39!$H24","v":1},{"$f":"User40!$H24","v":1},{"$f":"User41!$H24","v":1},{"$f":"User42!$H24","v":1},{"$f":"User43!$H24","v":1},{"$f":"User44!$H24","v":1},{"$f":"User45!$H24","v":1},{"$f":"User46!$H24","v":1},{"$f":"User47!$H24","v":1},{"$f":"User48!$H24","v":1},{"$f":"User49!$H24","v":1},{"$f":"User50!$H24","v":1},null,0,{"$f":"IFERROR(BB15*100/SUM(BB4:BB15), 0)","v":0},{"$f":"IF((BB15>0),RANK(BB15,BB4:BB15,0),\"SIN RANGO\")","v":"SIN RANGO"},null,1,{"$f":"IFERROR(STDEV(IF(C15:AZ15<>1, C15:AZ15, \"\")), 0)","v":0},{"$f":"IFERROR(MEDIAN(IF(C15:AZ15<>1, C15:AZ15, \"\")), 1)","v":1},"SIN RANGO",null,0]
[]
[null,null,null,null,null,null,null,null,null,null,null,null,null,null,null,null,null,null,null,null,null,null,null,null,null,null,null,null,null,null,null,null,null,null,null,null,null,null,null,null,null,null,null,null,null,null,null,null,null,null,null,null,null,null,null,null,null,null,null,null,null,null,{"$f":"SUM(BK4:BK15)","v":0},{"$f":"SUM(BL7:BL12)","v":0},"MENCIONES"]
[null,null,null,null,null,null,null,null,null,null,null,null,null,null,null,null,null,null,null,null,null,null,null,null,null,null,null,null,null,null,null,null,null,null,null,null,null,null,null,null,null,null,null,null,null,null,null,null,null,null,null,null,null,null,null,null,null,null,null,null,null,null,{"$f":"IFERROR(BK17*100/(SUM(BK17:BL17)), 0)","v":0},{"$f":"IFERROR(BL17*100/(SUM(BK17:BL17)), 0)","v":0},"PORCENTAJES"]

{"sheet":"ItemB","index":52,"n_rows":18,"n_cols":65,"rows_kept":18,"cut":false,"hidden":false,"merged":[[1,63,2,63],[1,49,2,49],[1,50,2,50],[1,51,2,51],[1,53,2,53],[1,54,2,54],[1,55,2,55],[1,57,2,57],[1,58,2,58],[1,59,2,59],[1,60,2,60],[1,62,2,62],[1,48,2,48],[1,37,2,37],[1,38,2,38],[1,39,2,39],[1,40,2,40],[1,41,2,41],[1,42,2,42],[1,43,2,43],[1,44,2,44],[1,45,2,45],[1,46,2,46],[1,47,2,47],[1,36,2,36],[1,25,2,25],[1,26,2,26],[1,27,2,27],[1,28,2,28],[1,29,2,29],[1,30,2,30],[1,31,2,31],[1,32,2,32],[1,33,2,33],[1,34,2,34],[1,35,2,35],[1,24,2,24],[1,13,2,13],[1,14,2,14],[1,15,2,15],[1,16,2,16],[1,17,2,17],[1,18,2,18],[1,19,2,19],[1,20,2,20],[1,21,2,21],[1,22,2,22],[1,23,2,23],[1,12,2,12],[1,1,2,1],[1,2,2,2],[1,3,2,3],[1,4,2,4],[1,5,2,5],[1,6,2,6],[1,7,2,7],[1,8,2,8],[1,9,2,9],[1,10,2,10],[1,11,2,11]]}
[]
[null,"EMOCIONES/USUARIOS",1,2,3,4,5,6,7,8,9,10,11,12,13,14,15,16,17,18,19,20,21,22,23,24,25,26,27,28,29,30,31,32,33,34,35,36,37,38,39,40,41,42,43,44,45,46,47,48,49,50,null,"FRECUENCIA","% DE MENCIÓN","JERARQUÍA FRECUENCIA (MEDIA)",null,"MEDIA DE INTENSIDAD","DESVIACION ESTÁNDAR","MEDIANA DE INTENSIDAD","JERARQUÍA INTENSIDAD (MEDIA)",null,"POSITIVAS","NEGATIVAS"]
[]
[null,{"$f":"User01!B13","v":"ALEGRÍA"},{"$f":"User01!H30","v":1},{"$f":"User02!$H30","v":1},{"$f":"User03!$H30","v":1},{"$f":"User04!$H30","v":1},{"$f":"User05!$H30","v":1},{"$f":"User06!$H30","v":1},{"$f":"User07!$H30","v":1},{"$f":"User08!$H30","v":1},{"$f":"User09!$H30","v":1},{"$f":"User10!$H30","v":1},{"$f":"User11!$H30","v":1},{"$f":"User12!$H30","v":1},{"$f":"User13!$H30","v":1},{"$f":"User14!$H30","v":1},{"$f":"User15!$H30","v":1},{"$f":"User16!$H30","v":1},{"$f":"User17!$H30","v":1},{"$f":"User18!$H30","v":1},{"$f":"User19!$H30","v":1},{"$f":"User20!$H30","v":1},{"$f":"User21!$H30","v":1},{"$f":"User22!$H30","v":1},{"$f":"User23!$H30","v":1},{"$f":"User24!$H30","v":1},{"$f":"User25!$H30","v":1},{"$f":"User26!$H30","v":1},{"$f":"User27!$H30","v":1},{"$f":"User28!$H30","v":1},{"$f":"User29!$H30","v":1},{"$f":"User30!$H30","v":1},{"$f":"User31!$H30","v":1},{"$f":"User32!$H30","v":1},{"$f":"User33!$H30","v":1},{"$f":"User34!$H30","v":1},{"$f":"User35!$H30","v":1},{"$f":"User36!$H30","v":1},{"$f":"User37!$H30","v":1},{"$f":"User38!$H30","v":1},{"$f":"User39!$H30","v":1},{"$f":"User40!$H30","v":1},{"$f":"User41!$H30","v":1},{"$f":"User42!$H30","v":1},{"$f":"User43!$H30","v":1},{"$f":"User44!$H30","v":1},{"$f":"User45!$H30","v":1},{"$f":"User46!$H30","v":1},{"$f":"User47!$H30","v":1},{"$f":"User48!$H30","v":1},{"$f":"User49!$H30","v":1},{"$f":"User50!$H30","v":1},null,{"$f":"COUNTIF(C4:AZ4, \"<>1\")","v":0},{"$f":"IFERROR(BB4*100/SUM(BB4:BB15), 0)","v":0},{"$f":"IF((BB4>0),RANK(BB4,BB4:BB15,0),\"SIN RANGO\")","v":"SIN RANGO"},null,{"$f":"IFERROR(AVERAGEIF(C4:AZ4, \">1\"), 1)","v":1},{"$f":"IFERROR(STDEV(IF(C4:AZ4<>1, C4:AZ4, \"\")), 0)","v":0},{"$f":"IFERROR(MEDIAN(IF(C4:AZ4<>1, C4:AZ4, \"\")), 1)","v":1},{"$f":"IF((BF4>1),RANK(BF4,$BF$4:$BF$15,0),\"SIN RANGO\")","v":"SIN RANGO"},null,{"$f":"BB4","v":0}]
[null,{"$f":"User01!B14","v":"SATISFACCIÓN"},{"$f":"User01!H31","v":1},{"$f":"User02!$H31","v":1},{"$f":"User03!$H31","v":1},{"$f":"User04!$H31","v":1},{"$f":"User05!$H31","v":1},{"$f":"User06!$H31","v":1},{"$f":"User07!$H31","v":1},{"$f":"User08!$H31","v":1},{"$f":"User09!$H31","v":1},{"$f":"User10!$H31","v":1},{"$f":"User11!$H31","v":1},{"$f":"User12!$H31","v":1},{"$f":"User13!$H31","v":1},{"$f":"User14!$H31","v":1},{"$f":"User15!$H31","v":1},{"$f":"User16!$H31","v":1},{"$f":"User17!$H31","v":1},{"$f":"User18!$H31","v":1},{"$f":"User19!$H31","v":1},{"$f":"User20!$H31","v":1},{"$f":"User21!$H31","v":1},{"$f":"User22!$H31","v":1},{"$f":"User23!$H31","v":1},{"$f":"User24!$H31","v":1},{"$f":"User25!$H31","v":1},{"$f":"User26!$H31","v":1},{"$f":"User27!$H31","v":1},{"$f":"User28!$H31","v":1},{"$f":"User29!$H31","v":1},{"$f":"User30!$H31","v":1},{"$f":"User31!$H31","v":1},{"$f":"User32!$H31","v":1},{"$f":"User33!$H31","v":1},{"$f":"User34!$H31","v":1},{"$f":"User35!$H31","v":1},{"$f":"User36!$H31","v":1},{"$f":"User37!$H31","v":1},{"$f":"User38!$H31","v":1},{"$f":"User39!$H31","v":1},{"$f":"User40!$H31","v":1},{"$f":"User41!$H31","v":1},{"$f":"User42!$H31","v":1},{"$f":"User43!$H31","v":1},{"$f":"User44!$H31","v":1},{"$f":"User45!$H31","v":1},{"$f":"User46!$H31","v":1},{"$f":"User47!$H31","v":1},{"$f":"User48!$H31","v":1},{"$f":"User49!$H31","v":1},{"$f":"User50!$H31","v":1},null,{"$f":"COUNTIF(C5:AZ5, \"<>1\")","v":0},{"$f":"IFERROR(BB5*100/SUM(BB4:BB15), 0)","v":0},{"$f":"IF((BB5>0),RANK(BB5,BB4:BB15,0),\"SIN RANGO\")","v":"SIN RANGO"},null,{"$f":"IFERROR(AVERAGEIF(C5:AZ5, \">1\"), 1)","v":1},{"$f":"IFERROR(STDEV(IF(C5:AZ5<>1, C5:AZ5, \"\")), 0)","v":0},{"$f":"IFERROR(MEDIAN(IF(C5:AZ5<>1, C5:AZ5, \"\")), 1)","v":1},{"$f":"IF((BF5>1),RANK(BF5,$BF$4:$BF$15,0),\"SIN RANGO\")","v":"SIN RANGO"},null,{"$f":"BB5","v":0}]
[null,{"$f":"User01!B15","v":"FASCINACIÓN"},{"$f":"User01!H32","v":1},{"$f":"User02!$H32","v":1},{"$f":"User03!$H32","v":1},{"$f":"User04!$H32","v":1},{"$f":"User05!$H32","v":1},{"$f":"User06!$H32","v":1},{"$f":"User07!$H32","v":1},{"$f":"User08!$H32","v":1},{"$f":"User09!$H32","v":1},{"$f":"User10!$H32","v":1},{"$f":"User11!$H32","v":1},{"$f":"User12!$H32","v":1},{"$f":"User13!$H32","v":1},{"$f":"User14!$H32","v":1},{"$f":"User15!$H32","v":1},{"$f":"User16!$H32","v":1},{"$f":"User17!$H32","v":1},{"$f":"User18!$H32","v":1},{"$f":"User19!$H32","v":1},{"$f":"User20!$H32","v":1},{"$f":"User21!$H32","v":1},{"$f":"User22!$H32","v":1},{"$f":"User23!$H32","v":1},{"$f":"User24!$H32","v":1},{"$f":"User25!$H32","v":1},{"$f":"User26!$H32","v":1},{"$f":"User27!$H32","v":1},{"$f":"User28!$H32","v":1},{"$f":"User29!$H32","v":1},{"$f":"User30!$H32","v":1},{"$f":"User31!$H32","v":1},{"$f":"User32!$H32","v":1},{"$f":"User33!$H32","v":1},{"$f":"User34!$H32","v":1},{"$f":"User35!$H32","v":1},{"$f":"User36!$H32","v":1},{"$f":"User37!$H32","v":1},{"$f":"User38!$H32","v":1},{"$f":"User39!$H32","v":1},{"$f":"User40!$H32","v":1},{"$f":"User41!$H32","v":1},{"$f":"User42!$H32","v":1},{"$f":"User43!$H32","v":1},{"$f":"User44!$H32","v":1},{"$f":"User45!$H32","v":1},{"$f":"User46!$H32","v":1},{"$f":"User47!$H32","v":1},{"$f":"User48!$H32","v":1},{"$f":"User49!$H32","v":1},{"$f":"User50!$H32","v":1},null,0,{"$f":"IFERROR(BB6*100/SUM(BB4:BB15), 0)","v":0},{"$f":"IF((BB6>0),RANK(BB6,BB4:BB15,0),\"SIN RANGO\")","v":"SIN RANGO"},null,1,{"$f":"IFERROR(STDEV(IF(C6:AZ6<>1, C6:AZ6, \"\")), 0)","v":0},{"$f":"IFERROR(MEDIAN(IF(C6:AZ6<>1, C6:AZ6, \"\")), 1)","v":1},"SIN RANGO",null,0]
[null,{"$f":"User01!B16","v":"ABURRIMIENTO"},{"$f":"User01!H33","v":1},{"$f":"User02!$H33","v":1},{"$f":"User03!$H33","v":1},{"$f":"User04!$H33","v":1},{"$f":"User05!$H33","v":1},{"$f":"User06!$H33","v":1},{"$f":"User07!$H33","v":1},{"$f":"User08!$H33","v":1},{"$f":"User09!$H33","v":1},{"$f":"User10!$H33","v":1},{"$f":"User11!$H33","v":1},{"$f":"User12!$H33","v":1},{"$f":"User13!$H33","v":1},{"$f":"User14!$H33","v":1},{"$f":"User15!$H33","v":1},{"$f":"User16!$H33","v":1},{"$f":"User17!$H33","v":1},{"$f":"User18!$H33","v":1},{"$f":"User19!$H33","v":1},{"$f":"User20!$H33","v":1},{"$f":"User21!$H33","v":1},{"$f":"User22!$H33","v":1},{"$f":"User23!$H33","v":1},{"$f":"User24!$H33","v":1},{"$f":"User25!$H33","v":1},{"$f":"User26!$H33","v":1},{"$f":"User27!$H33","v":1},{"$f":"User28!$H33","v":1},{"$f":"User29!$H33","v":1},{"$f":"User30!$H33","v":1},{"$f":"User31!$H33","v":1},{"$f":"User32!$H33","v":1},{"$f":"User33!$H33","v":1},{"$f":"User34!$H33","v":1},{"$f":"User35!$H33","v":1},{"$f":"User36!$H33","v":1},{"$f":"User37!$H33","v":1},{"$f":"User38!$H33","v":1},{"$f":"User39!$H33","v":1},{"$f":"User40!$H33","v":1},{"$f":"User41!$H33","v":1},{"$f":"User42!$H33","v":1},{"$f":"User43!$H33","v":1},{"$f":"User44!$H33","v":1},{"$f":"User45!$H33","v":1},{"$f":"User46!$H33","v":1},{"$f":"User47!$H33","v":1},{"$f":"User48!$H33","v":1},{"$f":"User49!$H33","v":1},{"$f":"User50!$H33","v":1},null,0,{"$f":"IFERROR(BB7*100/SUM(BB4:BB15), 0)","v":0},{"$f":"IF((BB7>0),RANK(BB7,BB4:BB15,0),\"SIN RANGO\")","v":"SIN RANGO"},null,1,{"$f":"IFERROR(STDEV(IF(C7:AZ7<>1, C7:AZ7, \"\")), 0)","v":0},{"$f":"IFERROR(MEDIAN(IF(C7:AZ7<>1, C7:AZ7, \"\")), 1)","v":1},"SIN RANGO",null,null,{"$f":"BB7:BB12","v":0}]
[null,{"$f":"User01!B17","v":"ENFADO"},{"$f":"User01!H34","v":1},{"$f":"User02!$H34","v":1},{"$f":"User03!$H34","v":1},{"$f":"User04!$H34","v":1},{"$f":"User05!$H34","v":1},{"$f":"User06!$H34","v":1},{"$f":"User07!$H34","v":1},{"$f":"User08!$H34","v":1},{"$f":"User09!$H34","v":1},{"$f":"User10!$H34","v":1},{"$f":"User11!$H34","v":1},{"$f":"User12!$H34","v":1},{"$f":"User13!$H34","v":1},{"$f":"User14!$H34","v":1},{"$f":"User15!$H34","v":1},{"$f":"User16!$H34","v":1},{"$f":"User17!$H34","v":1},{"$f":"User18!$H34","v":1},{"$f":"User19!$H34","v":1},{"$f":"User20!$H34","v":1},{"$f":"User21!$H34","v":1},{"$f":"User22!$H34","v":1},{"$f":"User23!$H34","v":1},{"$f":"User24!$H34","v":1},{"$f":"User25!$H34","v":1},{"$f":"User26!$H34","v":1},{"$f":"User27!$H34","v":1},{"$f":"User28!$H34","v":1},{"$f":"User29!$H34","v":1},{"$f":"User30!$H34","v":1},{"$f":"User31!$H34","v":1},{"$f":"User32!$H34","v":1},{"$f":"User33!$H34","v":1},{"$f":"User34!$H34","v":1},{"$f":"User35!$H34","v":1},{"$f":"User36!$H34","v":1},{"$f":"User37!$H34","v":1},{"$f":"User38!$H34","v":1},{"$f":"User39!$H34","v":1},{"$f":"User40!$H34","v":1},{"$f":"User41!$H34","v":1},{"$f":"User42!$H34","v":1},{"$f":"User43!$H34","v":1},{"$f":"User44!$H34","v":1},{"$f":"User45!$H34","v":1},{"$f":"User46!$H34","v":1},{"$f":"User47!$H34","v":1},{"$f":"User48!$H34","v":1},{"$f":"User49!$H34","v":1},{"$f":"User50!$H34","v":1},null,0,{"$f":"IFERROR(BB8*100/SUM(BB4:BB15), 0)","v":0},{"$f":"IF((BB8>0),RANK(BB8,BB4:BB15,0),\"SIN RANGO\")","v":"SIN RANGO"},null,1,{"$f":"IFERROR(STDEV(IF(C8:AZ8<>1, C8:AZ8, \"\")), 0)","v":0},{"$f":"IFERROR(MEDIAN(IF(C8:AZ8<>1, C8:AZ8, \"\")), 1)","v":1},"SIN RANGO",null,null,{"$f":"BB8:BB13","v":0}]
[null,{"$f":"User01!B18","v":"TRISTEZA"},{"$f":"User01!H35","v":1},{"$f":"User02!$H35","v":1},{"$f":"User03!$H35","v":1},{"$f":"User04!$H35","v":1},{"$f":"User05!$H35","v":1},{"$f":"User06!$H35","v":1},{"$f":"User07!$H35","v":1},{"$f":"User08!$H35","v":1},{"$f":"User09!$H35","v":1},{"$f":"User10!$H35","v":1},{"$f":"User11!$H35","v":1},{"$f":"User12!$H35","v":1},{"$f":"User13!$H35","v":1},{"$f":"User14!$H35","v":1},{"$f":"User15!$H35","v":1},{"$f":"User16!$H35","v":1},{"$f":"User17!$H35","v":1},{"$f":"User18!$H35","v":1},{"$f":"User19!$H35","v":1},{"$f":"User20!$H35","v":1},{"$f":"User21!$H35","v":1},{"$f":"User22!$H35","v":1},{"$f":"User23!$H35","v":1},{"$f":"User24!$H35","v":1},{"$f":"User25!$H35","v":1},{"$f":"User26!$H35","v":1},{"$f":"User27!$H35","v":1},{"$f":"User28!$H35","v":1},{"$f":"User29!$H35","v":1},{"$f":"User30!$H35","v":1},{"$f":"User31!$H35","v":1},{"$f":"User32!$H35","v":1},{"$f":"User33!$H35","v":1},{"$f":"User34!$H35","v":1},{"$f":"User35!$H35","v":1},{"$f":"User36!$H35","v":1},{"$f":"User37!$H35","v":1},{"$f":"User38!$H35","v":1},{"$f":"User39!$H35","v":1},{"$f":"User40!$H35","v":1},{"$f":"User41!$H35","v":1},{"$f":"User42!$H35","v":1},{"$f":"User43!$H35","v":1},{"$f":"User44!$H35","v":1},{"$f":"User45!$H35","v":1},{"$f":"User46!$H35","v":1},{"$f":"User47!$H35","v":1},{"$f":"User48!$H35","v":1},{"$f":"User49!$H35","v":1},{"$f":"User50!$H35","v":1},null,0,{"$f":"IFERROR(BB9*100/SUM(BB4:BB15), 0)","v":0},{"$f":"IF((BB9>0),RANK(BB9,BB4:BB15,0),\"SIN RANGO\")","v":"SIN RANGO"},null,1,{"$f":"IFERROR(STDEV(IF(C9:AZ9<>1, C9:AZ9, \"\")), 0)","v":0},{"$f":"IFERROR(MEDIAN(IF(C9:AZ9<>1, C9:AZ9, \"\")), 1)","v":1},"SIN RANGO",null,null,0]
[null,{"$f":"User01!B19","v":"VERGÜENZA"},{"$f":"User01!H36","v":1},{"$f":"User02!$H36","v":1},{"$f":"User03!$H36","v":1},{"$f":"User04!$H36","v":1},{"$f":"User05!$H36","v":1},{"$f":"User06!$H36","v":1},{"$f":"User07!$H36","v":1},{"$f":"User08!$H36","v":1},{"$f":"User09!$H36","v":1},{"$f":"User10!$H36","v":1},{"$f":"User11!$H36","v":1},{"$f":"User12!$H36","v":1},{"$f":"User13!$H36","v":1},{"$f":"User14!$H36","v":1},{"$f":"User15!$H36","v":1},{"$f":"User16!$H36","v":1},{"$f":"User17!$H36","v":1},{"$f":"User18!$H36","v":1},{"$f":"User19!$H36","v":1},{"$f":"User20!$H36","v":1},{"$f":"User21!$H36","v":1},{"$f":"User22!$H36","v":1},{"$f":"User23!$H36","v":1},{"$f":"User24!$H36","v":1},{"$f":"User25!$H36","v":1},{"$f":"User26!$H36","v":1},{"$f":"User27!$H36","v":1},{"$f":"User28!$H36","v":1},{"$f":"User29!$H36","v":1},{"$f":"User30!$H36","v":1},{"$f":"User31!$H36","v":1},{"$f":"User32!$H36","v":1},{"$f":"User33!$H36","v":1},{"$f":"User34!$H36","v":1},{"$f":"User35!$H36","v":1},{"$f":"User36!$H36","v":1},{"$f":"User37!$H36","v":1},{"$f":"User38!$H36","v":1},{"$f":"User39!$H36","v":1},{"$f":"User40!$H36","v":1},{"$f":"User41!$H36","v":1},{"$f":"User42!$H36","v":1},{"$f":"User43!$H36","v":1},{"$f":"User44!$H36","v":1},{"$f":"User45!$H36","v":1},{"$f":"User46!$H36","v":1},{"$f":"User47!$H36","v":1},{"$f":"User48!$H36","v":1},{"$f":"User49!$H36","v":1},{"$f":"User50!$H36","v":1},null,0,{"$f":"IFERROR(BB10*100/SUM(BB4:BB15), 0)","v":0},{"$f":"IF((BB10>0),RANK(BB10,BB4:BB15,0),\"SIN RANGO\")","v":"SIN RANGO"},null,1,{"$f":"IFERROR(STDEV(IF(C10:AZ10<>1, C10:AZ10, \"\")), 0)","v":0},{"$f":"IFERROR(MEDIAN(IF(C10:AZ10<>1, C10:AZ10, \"\")), 1)","v":1},"SIN RANGO",null,null,{"$f":"BB10:BB15","v":0}]
[null,{"$f":"User01!B20","v":"MIEDO"},{"$f":"User01!H37","v":1},{"$f":"User02!$H37","v":1},{"$f":"User03!$H37","v":1},{"$f":"User04!$H37","v":1},{"$f":"User05!$H37","v":1},{"$f":"User06!$H37","v":1},{"$f":"User07!$H37","v":1},{"$f":"User08!$H37","v":1},{"$f":"User09!$H37","v":1},{"$f":"User10!$H37","v":1},{"$f":"User11!$H37","v":1},{"$f":"User12!$H37","v":1},{"$f":"User13!$H37","v":1},{"$f":"User14!$H37","v":1},{"$f":"User15!$H37","v":1},{"$f":"User16!$H37","v":1},{"$f":"User17!$H37","v":1},{"$f":"User18!$H37","v":1},{"$f":"User19!$H37","v":1},{"$f":"User20!$H37","v":1},{"$f":"User21!$H37","v":1},{"$f":"User22!$H37","v":1},{"$f":"User23!$H37","v":1},{"$f":"User24!$H37","v":1},{"$f":"User25!$H37","v":1},{"$f":"User26!$H37","v":1},{"$f":"User27!$H37","v":1},{"$f":"User28!$H37","v":1},{"$f":"User29!$H37","v":1},{"$f":"User30!$H37","v":1},{"$f":"User31!$H37","v":1},{"$f":"User32!$H37","v":1},{"$f":"User33!$H37","v":1},{"$f":"User34!$H37","v":1},{"$f":"User35!$H37","v":1},{"$f":"User36!$H37","v":1},{"$f":"User37!$H37","v":1},{"$f":"User38!$H37","v":1},{"$f":"User39!$H37","v":1},{"$f":"User40!$H37","v":1},{"$f":"User41!$H37","v":1},{"$f":"User42!$H37","v":1},{"$f":"User43!$H37","v":1},{"$f":"User44!$H37","v":1},{"$f":"User45!$H37","v":1},{"$f":"User46!$H37","v":1},{"$f":"User47!$H37","v":1},{"$f":"User48!$H37","v":1},{"$f":"User49!$H37","v":1},{"$f":"User50!$H37","v":1},null,0,{"$f":"IFERROR(BB11*100/SUM(BB4:BB15), 0)","v":0},{"$f":"IF((BB11>0),RANK(BB11,BB4:BB15,0),\"SIN RANGO\")","v":"SIN RANGO"},null,1,{"$f":"IFERROR(STDEV(IF(C11:AZ11<>1, C11:AZ11, \"\")), 0)","v":0},{"$f":"IFERROR(MEDIAN(IF(C11:AZ11<>1, C11:AZ11, \"\")), 1)","v":1},"SIN RANGO",null,null,{"$f":"BB11:BB17","v":0}]
[null,{"$f":"User01!B21","v":"REPUGNANCIA"},{"$f":"User01!H38","v":1},{"$f":"User02!$H38","v":1},{"$f":"User03!$H38","v":1},{"$f":"User04!$H38","v":1},{"$f":"User05!$H38","v":1},{"$f":"User06!$H38","v":1},{"$f":"User07!$H38","v":1},{"$f":"User08!$H38","v":1},{"$f":"User09!$H38","v":1},{"$f":"User10!$H38","v":1},{"$f":"User11!$H38","v":1},{"$f":"User12!$H38","v":1},{"$f":"User13!$H38","v":1},{"$f":"User14!$H38","v":1},{"$f":"User15!$H38","v":1},{"$f":"User16!$H38","v":1},{"$f":"User17!$H38","v":1},{"$f":"User18!$H38","v":1},{"$f":"User19!$H38","v":1},{"$f":"User20!$H38","v":1},{"$f":"User21!$H38","v":1},{"$f":"User22!$H38","v":1},{"$f":"User23!$H38","v":1},{"$f":"User24!$H38","v":1},{"$f":"User25!$H38","v":1},{"$f":"User26!$H38","v":1},{"$f":"User27!$H38","v":1},{"$f":"User28!$H38","v":1},{"$f":"User29!$H38","v":1},{"$f":"User30!$H38","v":1},{"$f":"User31!$H38","v":1},{"$f":"User32!$H38","v":1},{"$f":"User33!$H38","v":1},{"$f":"User34!$H38","v":1},{"$f":"User35!$H38","v":1},{"$f":"User36!$H38","v":1},{"$f":"User37!$H38","v":1},{"$f":"User38!$H38","v":1},{"$f":"User39!$H38","v":1},{"$f":"User40!$H38","v":1},{"$f":"User41!$H38","v":1},{"$f":"User42!$H38","v":1},{"$f":"User43!$H38","v":1},{"$f":"User44!$H38","v":1},{"$f":"User45!$H38","v":1},{"$f":"User46!$H38","v":1},{"$f":"User47!$H38","v":1},{"$f":"User48!$H38","v":1},{"$f":"User49!$H38","v":1},{"$f":"User50!$H38","v":1},null,0,{"$f":"IFERROR(BB12*100/SUM(BB4:BB15), 0)","v":0},{"$f":"IF((BB12>0),RANK(BB12,BB4:BB15,0),\"SIN RANGO\")","v":"SIN RANGO"},null,1,{"$f":"IFERROR(STDEV(IF(C12:AZ12<>1, C12:AZ12, \"\")), 0)","v":0},{"$f":"IFERROR(MEDIAN(IF(C12:AZ12<>1, C12:AZ12, \"\")), 1)","v":1},"SIN RANGO",null,null,{"$f":"BB12:BB18","v":0}]
[null,{"$f":"User01!B22","v":"DESEO"},{"$f":"User01!H39","v":1},{"$f":"User02!$H39","v":1},{"$f":"User03!$H39","v":1},{"$f":"User04!$H39","v":1},{"$f":"User05!$H39","v":1},{"$f":"User06!$H39","v":1},{"$f":"User07!$H39","v":1},{"$f":"User08!$H39","v":1},{"$f":"User09!$H39","v":1},{"$f":"User10!$H39","v":1},{"$f":"User11!$H39","v":1},{"$f":"User12!$H39","v":1},{"$f":"User13!$H39","v":1},{"$f":"User14!$H39","v":1},{"$f":"User15!$H39","v":1},{"$f":"User16!$H39","v":1},{"$f":"User17!$H39","v":1},{"$f":"User18!$H39","v":1},{"$f":"User19!$H39","v":1},{"$f":"User20!$H39","v":1},{"$f":"User21!$H39","v":1},{"$f":"User22!$H39","v":1},{"$f":"User23!$H39","v":1},{"$f":"User24!$H39","v":1},{"$f":"User25!$H39","v":1},{"$f":"User26!$H39","v":1},{"$f":"User27!$H39","v":1},{"$f":"User28!$H39","v":1},{"$f":"User29!$H39","v":1},{"$f":"User30!$H39","v":1},{"$f":"User31!$H39","v":1},{"$f":"User32!$H39","v":1},{"$f":"User33!$H39","v":1},{"$f":"User34!$H39","v":1},{"$f":"User35!$H39","v":1},{"$f":"User36!$H39","v":1},{"$f":"User37!$H39","v":1},{"$f":"User38!$H39","v":1},{"$f":"User39!$H39","v":1},{"$f":"User40!$H39","v":1},{"$f":"User41!$H39","v":1},{"$f":"User42!$H39","v":1},{"$f":"User43!$H39","v":1},{"$f":"User44!$H39","v":1},{"$f":"User45!$H39","v":1},{"$f":"User46!$H39","v":1},{"$f":"User47!$H39","v":1},{"$f":"User48!$H39","v":1},{"$f":"User49!$H39","v":1},{"$f":"User50!$H39","v":1},null,0,{"$f":"IFERROR(BB13*100/SUM(BB4:BB15), 0)","v":0},{"$f":"IF((BB13>0),RANK(BB13,BB4:BB15,0),\"SIN RANGO\")","v":"SIN RANGO"},null,1,{"$f":"IFERROR(STDEV(IF(C13:AZ13<>1, C13:AZ13, \"\")), 0)","v":0},{"$f":"IFERROR(MEDIAN(IF(C13:AZ13<>1, C13:AZ13, \"\")), 1)","v":1},"SIN RANGO",null,{"$f":"BB13","v":0}]
[null,{"$f":"User01!B23","v":"ESPERANZA"},{"$f":"User01!H40","v":1},{"$f":"User02!$H40","v":1},{"$f":"User03!$H40","v":1},{"$f":"User04!$H40","v":1},{"$f":"User05!$H40","v":1},{"$f":"User06!$H40","v":1},{"$f":"User07!$H40","v":1},{"$f":"User08!$H40","v":1},{"$f":"User09!$H40","v":1},{"$f":"User10!$H40","v":1},{"$f":"User11!$H40","v":1},{"$f":"User12!$H40","v":1},{"$f":"User13!$H40","v":1},{"$f":"User14!$H40","v":1},{"$f":"User15!$H40","v":1},{"$f":"User16!$H40","v":1},{"$f":"User17!$H40","v":1},{"$f":"User18!$H40","v":1},{"$f":"User19!$H40","v":1},{"$f":"User20!$H40","v":1},{"$f":"User21!$H40","v":1},{"$f":"User22!$H40","v":1},{"$f":"User23!$H40","v":1},{"$f":"User24!$H40","v":1},{"$f":"User25!$H40","v":1},{"$f":"User26!$H40","v":1},{"$f":"User27!$H40","v":1},{"$f":"User28!$H40","v":1},{"$f":"User29!$H40","v":1},{"$f":"User30!$H40","v":1},{"$f":"User31!$H40","v":1},{"$f":"User32!$H40","v":1},{"$f":"User33!$H40","v":1},{"$f":"User34!$H40","v":1},{"$f":"User35!$H40","v":1},{"$f":"User36!$H40","v":1},{"$f":"User37!$H40","v":1},{"$f":"User38!$H40","v":1},{"$f":"User39!$H40","v":1},{"$f":"User40!$H40","v":1},{"$f":"User41!$H40","v":1},{"$f":"User42!$H40","v":1},{"$f":"User43!$H40","v":1},{"$f":"User44!$H40","v":1},{"$f":"User45!$H40","v":1},{"$f":"User46!$H40","v":1},{"$f":"User47!$H40","v":1},{"$f":"User48!$H40","v":1},{"$f":"User49!$H40","v":1},{"$f":"User50!$H40","v":1},null,0,{"$f":"IFERROR(BB14*100/SUM(BB4:BB15), 0)","v":0},{"$f":"IF((BB14>0),RANK(BB14,BB4:BB15,0),\"SIN RANGO\")","v":"SIN RANGO"},null,1,{"$f":"IFERROR(STDEV(IF(C14:AZ14<>1, C14:AZ14, \"\")), 0)","v":0},{"$f":"IFERROR(MEDIAN(IF(C14:AZ14<>1, C14:AZ14, \"\")), 1)","v":1},"SIN RANGO",null,{"$f":"BB14","v":0}]
[null,{"$f":"User01!B24","v":"ORGULLO"},{"$f":"User01!H41","v":1},{"$f":"User02!$H41","v":1},{"$f":"User03!$H41","v":1},{"$f":"User04!$H41","v":1},{"$f":"User05!$H41","v":1},{"$f":"User06!$H41","v":1},{"$f":"User07!$H41","v":1},{"$f":"User08!$H41","v":1},{"$f":"User09!$H41","v":1},{"$f":"User10!$H41","v":1},{"$f":"User11!$H41","v":1},{"$f":"User12!$H41","v":1},{"$f":"User13!$H41","v":1},{"$f":"User14!$H41","v":1},{"$f":"User15!$H41","v":1},{"$f":"User16!$H41","v":1},{"$f":"User17!$H41","v":1},{"$f":"User18!$H41","v":1},{"$f":"User19!$H41","v":1},{"$f":"User20!$H41","v":1},{"$f":"User21!$H41","v":1},{"$f":"User22!$H41","v":1},{"$f":"User23!$H41","v":1},{"$f":"User24!$H41","v":1},{"$f":"User25!$H41","v":1},{"$f":"User26!$H41","v":1},{"$f":"User27!$H41","v":1},{"$f":"User28!$H41","v":1},{"$f":"User29!$H41","v":1},{"$f":"User30!$H41","v":1},{"$f":"User31!$H41","v":1},{"$f":"User32!$H41","v":1},{"$f":"User33!$H41","v":1},{"$f":"User34!$H41","v":1},{"$f":"User35!$H41","v":1},{"$f":"User36!$H41","v":1},{"$f":"User37!$H41","v":1},{"$f":"User38!$H41","v":1},{"$f":"User39!$H41","v":1},{"$f":"User40!$H41","v":1},{"$f":"User41!$H41","v":1},{"$f":"User42!$H41","v":1},{"$f":"User43!$H41","v":1},{"$f":"User44!$H41","v":1},{"$f":"User45!$H41","v":1},{"$f":"User46!$H41","v":1},{"$f":"User47!$H41","v":1},{"$f":"User48!$H41","v":1},{"$f":"User49!$H41","v":1},{"$f":"User50!$H41","v":1},null,0,{"$f":"IFERROR(BB15*100/SUM(BB4:BB15), 0)","v":0},{"$f":"IF((BB15>0),RANK(BB15,BB4:BB15,0),\"SIN RANGO\")","v":"SIN RANGO"},null,1,{"$f":"IFERROR(STDEV(IF(C15:AZ15<>1, C15:AZ15, \"\")), 0)","v":0},{"$f":"IFERROR(MEDIAN(IF(C15:AZ15<>1, C15:AZ15, \"\")), 1)","v":1},"SIN RANGO",null,0]
[]
[null,null,null,null,null,null,null,null,null,null,null,null,null,null,null,null,null,null,null,null,null,null,null,null,null,null,null,null,null,null,null,null,null,null,null,null,null,null,null,null,null,null,null,null,null,null,null,null,null,null,null,null,null,null,null,null,null,null,null,null,null,null,{"$f":"SUM(BK4:BK15)","v":0},{"$f":"SUM(BL7:BL12)","v":0},"MENCIONES"]
[null,null,null,null,null,null,null,null,null,null,null,null,null,null,null,null,null,null,null,null,null,null,null,null,null,null,null,null,null,null,null,null,null,null,null,null,null,null,null,null,null,null,null,null,null,null,null,null,null,null,null,null,null,null,null,null,null,null,null,null,null,null,{"$f":"IFERROR(BK17*100/(SUM(BK17:BL17)), 0)","v":0},{"$f":"IFERROR(BL17*100/(SUM(BK17:BL17)), 0)","v":0},"PORCENTAJES"]

{"sheet":"ItemC","index":53,"n_rows":18,"n_cols":65,"rows_kept":18,"cut":false,"hidden":false,"merged":[[1,63,2,63],[1,49,2,49],[1,50,2,50],[1,51,2,51],[1,53,2,53],[1,54,2,54],[1,55,2,55],[1,57,2,57],[1,58,2,58],[1,59,2,59],[1,60,2,60],[1,62,2,62],[1,48,2,48],[1,37,2,37],[1,38,2,38],[1,39,2,39],[1,40,2,40],[1,41,2,41],[1,42,2,42],[1,43,2,43],[1,44,2,44],[1,45,2,45],[1,46,2,46],[1,47,2,47],[1,36,2,36],[1,25,2,25],[1,26,2,26],[1,27,2,27],[1,28,2,28],[1,29,2,29],[1,30,2,30],[1,31,2,31],[1,32,2,32],[1,33,2,33],[1,34,2,34],[1,35,2,35],[1,24,2,24],[1,13,2,13],[1,14,2,14],[1,15,2,15],[1,16,2,16],[1,17,2,17],[1,18,2,18],[1,19,2,19],[1,20,2,20],[1,21,2,21],[1,22,2,22],[1,23,2,23],[1,12,2,12],[1,1,2,1],[1,2,2,2],[1,3,2,3],[1,4,2,4],[1,5,2,5],[1,6,2,6],[1,7,2,7],[1,8,2,8],[1,9,2,9],[1,10,2,10],[1,11,2,11]]}
[]
[null,"EMOCIONES/USUARIOS",1,2,3,4,5,6,7,8,9,10,11,12,13,14,15,16,17,18,19,20,21,22,23,24,25,26,27,28,29,30,31,32,33,34,35,36,37,38,39,40,41,42,43,44,45,46,47,48,49,50,null,"FRECUENCIA","% DE MENCIÓN","JERARQUÍA FRECUENCIA (MEDIA)",null,"MEDIA DE INTENSIDAD","DESVIACION ESTÁNDAR","MEDIANA DE INTENSIDAD","JERARQUÍA INTENSIDAD (MEDIA)",null,"POSITIVAS","NEGATIVAS"]
[]
[null,{"$f":"User01!B13","v":"ALEGRÍA"},{"$f":"User01!$H47","v":1},{"$f":"User02!$H47","v":1},{"$f":"User03!$H47","v":1},{"$f":"User04!$H47","v":1},{"$f":"User05!$H47","v":1},{"$f":"User06!$H47","v":1},{"$f":"User07!$H47","v":1},{"$f":"User08!$H47","v":1},{"$f":"User09!$H47","v":1},{"$f":"User10!$H47","v":1},{"$f":"User11!$H47","v":1},{"$f":"User12!$H47","v":1},{"$f":"User13!$H47","v":1},{"$f":"User14!$H47","v":1},{"$f":"User15!$H47","v":1},{"$f":"User16!$H47","v":1},{"$f":"User17!$H47","v":1},{"$f":"User18!$H47","v":1},{"$f":"User19!$H47","v":1},{"$f":"User20!$H47","v":1},{"$f":"User21!$H47","v":1},{"$f":"User22!$H47","v":1},{"$f":"User23!$H47","v":1},{"$f":"User24!$H47","v":1},{"$f":"User25!$H47","v":1},{"$f":"User26!$H47","v":1},{"$f":"User27!$H47","v":1},{"$f":"User28!$H47","v":1},{"$f":"User29!$H47","v":1},{"$f":"User30!$H47","v":1},{"$f":"User31!$H47","v":1},{"$f":"User32!$H47","v":1},{"$f":"User33!$H47","v":1},{"$f":"User34!$H47","v":1},{"$f":"User35!$H47","v":1},{"$f":"User36!$H47","v":1},{"$f":"User37!$H47","v":1},{"$f":"User38!$H47","v":1},{"$f":"User39!$H47","v":1},{"$f":"User40!$H47","v":1},{"$f":"User41!$H47","v":1},{"$f":"User42!$H47","v":1},{"$f":"User43!$H47","v":1},{"$f":"User44!$H47","v":1},{"$f":"User45!$H47","v":1},{"$f":"User46!$H47","v":1},{"$f":"User47!$H47","v":1},{"$f":"User48!$H47","v":1},{"$f":"User49!$H47","v":1},{"$f":"User50!$H47","v":1},null,{"$f":"COUNTIF(C4:AZ4, \"<>1\")","v":0},{"$f":"IFERROR(BB4*100/SUM(BB4:BB15), 0)","v":0},{"$f":"IF((BB4>0),RANK(BB4,BB4:BB15,0),\"SIN RANGO\")","v":"SIN RANGO"},null,{"$f":"IFERROR(AVERAGEIF(C4:AZ4, \">1\"), 1)","v":1},{"$f":"IFERROR(STDEV(IF(C4:AZ4<>1, C4:AZ4, \"\")), 0)","v":0},{"$f":"IFERROR(MEDIAN(IF(C4:AZ4<>1, C4:AZ4, \"\")), 1)","v":1},{"$f":"IF((BF4>1),RANK(BF4,$BF$4:$BF$15,0),\"SIN RANGO\")","v":"SIN RANGO"},null,{"$f":"BB4","v":0}]
[null,{"$f":"User01!B14","v":"SATISFACCIÓN"},{"$f":"User01!H48","v":1},{"$f":"User02!$H48","v":1},{"$f":"User03!$H48","v":1},{"$f":"User04!$H48","v":1},{"$f":"User05!$H48","v":1},{"$f":"User06!$H48","v":1},{"$f":"User07!$H48","v":1},{"$f":"User08!$H48","v":1},{"$f":"User09!$H48","v":1},{"$f":"User10!$H48","v":1},{"$f":"User11!$H48","v":1},{"$f":"User12!$H48","v":1},{"$f":"User13!$H48","v":1},{"$f":"User14!$H48","v":1},{"$f":"User15!$H48","v":1},{"$f":"User16!$H48","v":1},{"$f":"User17!$H48","v":1},{"$f":"User18!$H48","v":1},{"$f":"User19!$H48","v":1},{"$f":"User20!$H48","v":1},{"$f":"User21!$H48","v":1},{"$f":"User22!$H48","v":1},{"$f":"User23!$H48","v":1},{"$f":"User24!$H48","v":1},{"$f":"User25!$H48","v":1},{"$f":"User26!$H48","v":1},{"$f":"User27!$H48","v":1},{"$f":"User28!$H48","v":1},{"$f":"User29!$H48","v":1},{"$f":"User30!$H48","v":1},{"$f":"User31!$H48","v":1},{"$f":"User32!$H48","v":1},{"$f":"User33!$H48","v":1},{"$f":"User34!$H48","v":1},{"$f":"User35!$H48","v":1},{"$f":"User36!$H48","v":1},{"$f":"User37!$H48","v":1},{"$f":"User38!$H48","v":1},{"$f":"User39!$H48","v":1},{"$f":"User40!$H48","v":1},{"$f":"User41!$H48","v":1},{"$f":"User42!$H48","v":1},{"$f":"User43!$H48","v":1},{"$f":"User44!$H48","v":1},{"$f":"User45!$H48","v":1},{"$f":"User46!$H48","v":1},{"$f":"User47!$H48","v":1},{"$f":"User48!$H48","v":1},{"$f":"User49!$H48","v":1},{"$f":"User50!$H48","v":1},null,{"$f":"COUNTIF(C5:AZ5, \"<>1\")","v":0},{"$f":"IFERROR(BB5*100/SUM(BB4:BB15), 0)","v":0},{"$f":"IF((BB5>0),RANK(BB5,BB4:BB15,0),\"SIN RANGO\")","v":"SIN RANGO"},null,{"$f":"IFERROR(AVERAGEIF(C5:AZ5, \">1\"), 1)","v":1},{"$f":"IFERROR(STDEV(IF(C5:AZ5<>1, C5:AZ5, \"\")), 0)","v":0},{"$f":"IFERROR(MEDIAN(IF(C5:AZ5<>1, C5:AZ5, \"\")), 1)","v":1},{"$f":"IF((BF5>1),RANK(BF5,$BF$4:$BF$15,0),\"SIN RANGO\")","v":"SIN RANGO"},null,{"$f":"BB5","v":0}]
[null,{"$f":"User01!B15","v":"FASCINACIÓN"},{"$f":"User01!H49","v":1},{"$f":"User02!$H49","v":1},{"$f":"User03!$H49","v":1},{"$f":"User04!$H49","v":1},{"$f":"User05!$H49","v":1},{"$f":"User06!$H49","v":1},{"$f":"User07!$H49","v":1},{"$f":"User08!$H49","v":1},{"$f":"User09!$H49","v":1},{"$f":"User10!$H49","v":1},{"$f":"User11!$H49","v":1},{"$f":"User12!$H49","v":1},{"$f":"User13!$H49","v":1},{"$f":"User14!$H49","v":1},{"$f":"User15!$H49","v":1},{"$f":"User16!$H49","v":1},{"$f":"User17!$H49","v":1},{"$f":"User18!$H49","v":1},{"$f":"User19!$H49","v":1},{"$f":"User20!$H49","v":1},{"$f":"User21!$H49","v":1},{"$f":"User22!$H49","v":1},{"$f":"User23!$H49","v":1},{"$f":"User24!$H49","v":1},{"$f":"User25!$H49","v":1},{"$f":"User26!$H49","v":1},{"$f":"User27!$H49","v":1},{"$f":"User28!$H49","v":1},{"$f":"User29!$H49","v":1},{"$f":"User30!$H49","v":1},{"$f":"User31!$H49","v":1},{"$f":"User32!$H49","v":1},{"$f":"User33!$H49","v":1},{"$f":"User34!$H49","v":1},{"$f":"User35!$H49","v":1},{"$f":"User36!$H49","v":1},{"$f":"User37!$H49","v":1},{"$f":"User38!$H49","v":1},{"$f":"User39!$H49","v":1},{"$f":"User40!$H49","v":1},{"$f":"User41!$H49","v":1},{"$f":"User42!$H49","v":1},{"$f":"User43!$H49","v":1},{"$f":"User44!$H49","v":1},{"$f":"User45!$H49","v":1},{"$f":"User46!$H49","v":1},{"$f":"User47!$H49","v":1},{"$f":"User48!$H49","v":1},{"$f":"User49!$H49","v":1},{"$f":"User50!$H49","v":1},null,0,{"$f":"IFERROR(BB6*100/SUM(BB4:BB15), 0)","v":0},{"$f":"IF((BB6>0),RANK(BB6,BB4:BB15,0),\"SIN RANGO\")","v":"SIN RANGO"},null,1,{"$f":"IFERROR(STDEV(IF(C6:AZ6<>1, C6:AZ6, \"\")), 0)","v":0},{"$f":"IFERROR(MEDIAN(IF(C6:AZ6<>1, C6:AZ6, \"\")), 1)","v":1},"SIN RANGO",null,0]
[null,{"$f":"User01!B16","v":"ABURRIMIENTO"},{"$f":"User01!H50","v":1},{"$f":"User02!$H50","v":1},{"$f":"User03!$H50","v":1},{"$f":"User04!$H50","v":1},{"$f":"User05!$H50","v":1},{"$f":"User06!$H50","v":1},{"$f":"User07!$H50","v":1},{"$f":"User08!$H50","v":1},{"$f":"User09!$H50","v":1},{"$f":"User10!$H50","v":1},{"$f":"User11!$H50","v":1},{"$f":"User12!$H50","v":1},{"$f":"User13!$H50","v":1},{"$f":"User14!$H50","v":1},{"$f":"User15!$H50","v":1},{"$f":"User16!$H50","v":1},{"$f":"User17!$H50","v":1},{"$f":"User18!$H50","v":1},{"$f":"User19!$H50","v":1},{"$f":"User20!$H50","v":1},{"$f":"User21!$H50","v":1},{"$f":"User22!$H50","v":1},{"$f":"User23!$H50","v":1},{"$f":"User24!$H50","v":1},{"$f":"User25!$H50","v":1},{"$f":"User26!$H50","v":1},{"$f":"User27!$H50","v":1},{"$f":"User28!$H50","v":1},{"$f":"User29!$H50","v":1},{"$f":"User30!$H50","v":1},{"$f":"User31!$H50","v":1},{"$f":"User32!$H50","v":1},{"$f":"User33!$H50","v":1},{"$f":"User34!$H50","v":1},{"$f":"User35!$H50","v":1},{"$f":"User36!$H50","v":1},{"$f":"User37!$H50","v":1},{"$f":"User38!$H50","v":1},{"$f":"User39!$H50","v":1},{"$f":"User40!$H50","v":1},{"$f":"User41!$H50","v":1},{"$f":"User42!$H50","v":1},{"$f":"User43!$H50","v":1},{"$f":"User44!$H50","v":1},{"$f":"User45!$H50","v":1},{"$f":"User46!$H50","v":1},{"$f":"User47!$H50","v":1},{"$f":"User48!$H50","v":1},{"$f":"User49!$H50","v":1},{"$f":"User50!$H50","v":1},null,0,{"$f":"IFERROR(BB7*100/SUM(BB4:BB15), 0)","v":0},{"$f":"IF((BB7>0),RANK(BB7,BB4:BB15,0),\"SIN RANGO\")","v":"SIN RANGO"},null,1,{"$f":"IFERROR(STDEV(IF(C7:AZ7<>1, C7:AZ7, \"\")), 0)","v":0},{"$f":"IFERROR(MEDIAN(IF(C7:AZ7<>1, C7:AZ7, \"\")), 1)","v":1},"SIN RANGO",null,null,{"$f":"BB7:BB12","v":0}]
[null,{"$f":"User01!B17","v":"ENFADO"},{"$f":"User01!H51","v":1},{"$f":"User02!$H51","v":1},{"$f":"User03!$H51","v":1},{"$f":"User04!$H51","v":1},{"$f":"User05!$H51","v":1},{"$f":"User06!$H51","v":1},{"$f":"User07!$H51","v":1},{"$f":"User08!$H51","v":1},{"$f":"User09!$H51","v":1},{"$f":"User10!$H51","v":1},{"$f":"User11!$H51","v":1},{"$f":"User12!$H51","v":1},{"$f":"User13!$H51","v":1},{"$f":"User14!$H51","v":1},{"$f":"User15!$H51","v":1},{"$f":"User16!$H51","v":1},{"$f":"User17!$H51","v":1},{"$f":"User18!$H51","v":1},{"$f":"User19!$H51","v":1},{"$f":"User20!$H51","v":1},{"$f":"User21!$H51","v":1},{"$f":"User22!$H51","v":1},{"$f":"User23!$H51","v":1},{"$f":"User24!$H51","v":1},{"$f":"User25!$H51","v":1},{"$f":"User26!$H51","v":1},{"$f":"User27!$H51","v":1},{"$f":"User28!$H51","v":1},{"$f":"User29!$H51","v":1},{"$f":"User30!$H51","v":1},{"$f":"User31!$H51","v":1},{"$f":"User32!$H51","v":1},{"$f":"User33!$H51","v":1},{"$f":"User34!$H51","v":1},{"$f":"User35!$H51","v":1},{"$f":"User36!$H51","v":1},{"$f":"User37!$H51","v":1},{"$f":"User38!$H51","v":1},{"$f":"User39!$H51","v":1},{"$f":"User40!$H51","v":1},{"$f":"User41!$H51","v":1},{"$f":"User42!$H51","v":1},{"$f":"User43!$H51","v":1},{"$f":"User44!$H51","v":1},{"$f":"User45!$H51","v":1},{"$f":"User46!$H51","v":1},{"$f":"User47!$H51","v":1},{"$f":"User48!$H51","v":1},{"$f":"User49!$H51","v":1},{"$f":"User50!$H51","v":1},null,0,{"$f":"IFERROR(BB8*100/SUM(BB4:BB15), 0)","v":0},{"$f":"IF((BB8>0),RANK(BB8,BB4:BB15,0),\"SIN RANGO\")","v":"SIN RANGO"},null,1,{"$f":"IFERROR(STDEV(IF(C8:AZ8<>1, C8:AZ8, \"\")), 0)","v":0},{"$f":"IFERROR(MEDIAN(IF(C8:AZ8<>1, C8:AZ8, \"\")), 1)","v":1},"SIN RANGO",null,null,{"$f":"BB8:BB13","v":0}]
[null,{"$f":"User01!B18","v":"TRISTEZA"},{"$f":"User01!H52","v":1},{"$f":"User02!$H52","v":1},{"$f":"User03!$H52","v":1},{"$f":"User04!$H52","v":1},{"$f":"User05!$H52","v":1},{"$f":"User06!$H52","v":1},{"$f":"User07!$H52","v":1},{"$f":"User08!$H52","v":1},{"$f":"User09!$H52","v":1},{"$f":"User10!$H52","v":1},{"$f":"User11!$H52","v":1},{"$f":"User12!$H52","v":1},{"$f":"User13!$H52","v":1},{"$f":"User14!$H52","v":1},{"$f":"User15!$H52","v":1},{"$f":"User16!$H52","v":1},{"$f":"User17!$H52","v":1},{"$f":"User18!$H52","v":1},{"$f":"User19!$H52","v":1},{"$f":"User20!$H52","v":1},{"$f":"User21!$H52","v":1},{"$f":"User22!$H52","v":1},{"$f":"User23!$H52","v":1},{"$f":"User24!$H52","v":1},{"$f":"User25!$H52","v":1},{"$f":"User26!$H52","v":1},{"$f":"User27!$H52","v":1},{"$f":"User28!$H52","v":1},{"$f":"User29!$H52","v":1},{"$f":"User30!$H52","v":1},{"$f":"User31!$H52","v":1},{"$f":"User32!$H52","v":1},{"$f":"User33!$H52","v":1},{"$f":"User34!$H52","v":1},{"$f":"User35!$H52","v":1},{"$f":"User36!$H52","v":1},{"$f":"User37!$H52","v":1},{"$f":"User38!$H52","v":1},{"$f":"User39!$H52","v":1},{"$f":"User40!$H52","v":1},{"$f":"User41!$H52","v":1},{"$f":"User42!$H52","v":1},{"$f":"User43!$H52","v":1},{"$f":"User44!$H52","v":1},{"$f":"User45!$H52","v":1},{"$f":"User46!$H52","v":1},{"$f":"User47!$H52","v":1},{"$f":"User48!$H52","v":1},{"$f":"User49!$H52","v":1},{"$f":"User50!$H52","v":1},null,0,{"$f":"IFERROR(BB9*100/SUM(BB4:BB15), 0)","v":0},{"$f":"IF((BB9>0),RANK(BB9,BB4:BB15,0),\"SIN RANGO\")","v":"SIN RANGO"},null,1,{"$f":"IFERROR(STDEV(IF(C9:AZ9<>1, C9:AZ9, \"\")), 0)","v":0},{"$f":"IFERROR(MEDIAN(IF(C9:AZ9<>1, C9:AZ9, \"\")), 1)","v":1},"SIN RANGO",null,null,0]
[null,{"$f":"User01!B19","v":"VERGÜENZA"},{"$f":"User01!H53","v":1},{"$f":"User02!$H53","v":1},{"$f":"User03!$H53","v":1},{"$f":"User04!$H53","v":1},{"$f":"User05!$H53","v":1},{"$f":"User06!$H53","v":1},{"$f":"User07!$H53","v":1},{"$f":"User08!$H53","v":1},{"$f":"User09!$H53","v":1},{"$f":"User10!$H53","v":1},{"$f":"User11!$H53","v":1},{"$f":"User12!$H53","v":1},{"$f":"User13!$H53","v":1},{"$f":"User14!$H53","v":1},{"$f":"User15!$H53","v":1},{"$f":"User16!$H53","v":1},{"$f":"User17!$H53","v":1},{"$f":"User18!$H53","v":1},{"$f":"User19!$H53","v":1},{"$f":"User20!$H53","v":1},{"$f":"User21!$H53","v":1},{"$f":"User22!$H53","v":1},{"$f":"User23!$H53","v":1},{"$f":"User24!$H53","v":1},{"$f":"User25!$H53","v":1},{"$f":"User26!$H53","v":1},{"$f":"User27!$H53","v":1},{"$f":"User28!$H53","v":1},{"$f":"User29!$H53","v":1},{"$f":"User30!$H53","v":1},{"$f":"User31!$H53","v":1},{"$f":"User32!$H53","v":1},{"$f":"User33!$H53","v":1},{"$f":"User34!$H53","v":1},{"$f":"User35!$H53","v":1},{"$f":"User36!$H53","v":1},{"$f":"User37!$H53","v":1},{"$f":"User38!$H53","v":1},{"$f":"User39!$H53","v":1},{"$f":"User40!$H53","v":1},{"$f":"User41!$H53","v":1},{"$f":"User42!$H53","v":1},{"$f":"User43!$H53","v":1},{"$f":"User44!$H53","v":1},{"$f":"User45!$H53","v":1},{"$f":"User46!$H53","v":1},{"$f":"User47!$H53","v":1},{"$f":"User48!$H53","v":1},{"$f":"User49!$H53","v":1},{"$f":"User50!$H53","v":1},null,0,{"$f":"IFERROR(BB10*100/SUM(BB4:BB15), 0)","v":0},{"$f":"IF((BB10>0),RANK(BB10,BB4:BB15,0),\"SIN RANGO\")","v":"SIN RANGO"},null,1,{"$f":"IFERROR(STDEV(IF(C10:AZ10<>1, C10:AZ10, \"\")), 0)","v":0},{"$f":"IFERROR(MEDIAN(IF(C10:AZ10<>1, C10:AZ10, \"\")), 1)","v":1},"SIN RANGO",null,null,{"$f":"BB10:BB15","v":0}]
[null,{"$f":"User01!B20","v":"MIEDO"},{"$f":"User01!H54","v":1},{"$f":"User02!$H54","v":1},{"$f":"User03!$H54","v":1},{"$f":"User04!$H54","v":1},{"$f":"User05!$H54","v":1},{"$f":"User06!$H54","v":1},{"$f":"User07!$H54","v":1},{"$f":"User08!$H54","v":1},{"$f":"User09!$H54","v":1},{"$f":"User10!$H54","v":1},{"$f":"User11!$H54","v":1},{"$f":"User12!$H54","v":1},{"$f":"User13!$H54","v":1},{"$f":"User14!$H54","v":1},{"$f":"User15!$H54","v":1},{"$f":"User16!$H54","v":1},{"$f":"User17!$H54","v":1},{"$f":"User18!$H54","v":1},{"$f":"User19!$H54","v":1},{"$f":"User20!$H54","v":1},{"$f":"User21!$H54","v":1},{"$f":"User22!$H54","v":1},{"$f":"User23!$H54","v":1},{"$f":"User24!$H54","v":1},{"$f":"User25!$H54","v":1},{"$f":"User26!$H54","v":1},{"$f":"User27!$H54","v":1},{"$f":"User28!$H54","v":1},{"$f":"User29!$H54","v":1},{"$f":"User30!$H54","v":1},{"$f":"User31!$H54","v":1},{"$f":"User32!$H54","v":1},{"$f":"User33!$H54","v":1},{"$f":"User34!$H54","v":1},{"$f":"User35!$H54","v":1},{"$f":"User36!$H54","v":1},{"$f":"User37!$H54","v":1},{"$f":"User38!$H54","v":1},{"$f":"User39!$H54","v":1},{"$f":"User40!$H54","v":1},{"$f":"User41!$H54","v":1},{"$f":"User42!$H54","v":1},{"$f":"User43!$H54","v":1},{"$f":"User44!$H54","v":1},{"$f":"User45!$H54","v":1},{"$f":"User46!$H54","v":1},{"$f":"User47!$H54","v":1},{"$f":"User48!$H54","v":1},{"$f":"User49!$H54","v":1},{"$f":"User50!$H54","v":1},null,0,{"$f":"IFERROR(BB11*100/SUM(BB4:BB15), 0)","v":0},{"$f":"IF((BB11>0),RANK(BB11,BB4:BB15,0),\"SIN RANGO\")","v":"SIN RANGO"},null,1,{"$f":"IFERROR(STDEV(IF(C11:AZ11<>1, C11:AZ11, \"\")), 0)","v":0},{"$f":"IFERROR(MEDIAN(IF(C11:AZ11<>1, C11:AZ11, \"\")), 1)","v":1},"SIN RANGO",null,null,{"$f":"BB11:BB17","v":0}]
[null,{"$f":"User01!B21","v":"REPUGNANCIA"},{"$f":"User01!H55","v":1},{"$f":"User02!$H55","v":1},{"$f":"User03!$H55","v":1},{"$f":"User04!$H55","v":1},{"$f":"User05!$H55","v":1},{"$f":"User06!$H55","v":1},{"$f":"User07!$H55","v":1},{"$f":"User08!$H55","v":1},{"$f":"User09!$H55","v":1},{"$f":"User10!$H55","v":1},{"$f":"User11!$H55","v":1},{"$f":"User12!$H55","v":1},{"$f":"User13!$H55","v":1},{"$f":"User14!$H55","v":1},{"$f":"User15!$H55","v":1},{"$f":"User16!$H55","v":1},{"$f":"User17!$H55","v":1},{"$f":"User18!$H55","v":1},{"$f":"User19!$H55","v":1},{"$f":"User20!$H55","v":1},{"$f":"User21!$H55","v":1},{"$f":"User22!$H55","v":1},{"$f":"User23!$H55","v":1},{"$f":"User24!$H55","v":1},{"$f":"User25!$H55","v":1},{"$f":"User26!$H55","v":1},{"$f":"User27!$H55","v":1},{"$f":"User28!$H55","v":1},{"$f":"User29!$H55","v":1},{"$f":"User30!$H55","v":1},{"$f":"User31!$H55","v":1},{"$f":"User32!$H55","v":1},{"$f":"User33!$H55","v":1},{"$f":"User34!$H55","v":1},{"$f":"User35!$H55","v":1},{"$f":"User36!$H55","v":1},{"$f":"User37!$H55","v":1},{"$f":"User38!$H55","v":1},{"$f":"User39!$H55","v":1},{"$f":"User40!$H55","v":1},{"$f":"User41!$H55","v":1},{"$f":"User42!$H55","v":1},{"$f":"User43!$H55","v":1},{"$f":"User44!$H55","v":1},{"$f":"User45!$H55","v":1},{"$f":"User46!$H55","v":1},{"$f":"User47!$H55","v":1},{"$f":"User48!$H55","v":1},{"$f":"User49!$H55","v":1},{"$f":"User50!$H55","v":1},null,0,{"$f":"IFERROR(BB12*100/SUM(BB4:BB15), 0)","v":0},{"$f":"IF((BB12>0),RANK(BB12,BB4:BB15,0),\"SIN RANGO\")","v":"SIN RANGO"},null,1,{"$f":"IFERROR(STDEV(IF(C12:AZ12<>1, C12:AZ12, \"\")), 0)","v":0},{"$f":"IFERROR(MEDIAN(IF(C12:AZ12<>1, C12:AZ12, \"\")), 1)","v":1},"SIN RANGO",null,null,{"$f":"BB12:BB18","v":0}]
[null,{"$f":"User01!B22","v":"DESEO"},{"$f":"User01!H56","v":1},{"$f":"User02!$H56","v":1},{"$f":"User03!$H56","v":1},{"$f":"User04!$H56","v":1},{"$f":"User05!$H56","v":1},{"$f":"User06!$H56","v":1},{"$f":"User07!$H56","v":1},{"$f":"User08!$H56","v":1},{"$f":"User09!$H56","v":1},{"$f":"User10!$H56","v":1},{"$f":"User11!$H56","v":1},{"$f":"User12!$H56","v":1},{"$f":"User13!$H56","v":1},{"$f":"User14!$H56","v":1},{"$f":"User15!$H56","v":1},{"$f":"User16!$H56","v":1},{"$f":"User17!$H56","v":1},{"$f":"User18!$H56","v":1},{"$f":"User19!$H56","v":1},{"$f":"User20!$H56","v":1},{"$f":"User21!$H56","v":1},{"$f":"User22!$H56","v":1},{"$f":"User23!$H56","v":1},{"$f":"User24!$H56","v":1},{"$f":"User25!$H56","v":1},{"$f":"User26!$H56","v":1},{"$f":"User27!$H56","v":1},{"$f":"User28!$H56","v":1},{"$f":"User29!$H56","v":1},{"$f":"User30!$H56","v":1},{"$f":"User31!$H56","v":1},{"$f":"User32!$H56","v":1},{"$f":"User33!$H56","v":1},{"$f":"User34!$H56","v":1},{"$f":"User35!$H56","v":1},{"$f":"User36!$H56","v":1},{"$f":"User37!$H56","v":1},{"$f":"User38!$H56","v":1},{"$f":"User39!$H56","v":1},{"$f":"User40!$H56","v":1},{"$f":"User41!$H56","v":1},{"$f":"User42!$H56","v":1},{"$f":"User43!$H56","v":1},{"$f":"User44!$H56","v":1},{"$f":"User45!$H56","v":1},{"$f":"User46!$H56","v":1},{"$f":"User47!$H56","v":1},{"$f":"User48!$H56","v":1},{"$f":"User49!$H56","v":1},{"$f":"User50!$H56","v":1},null,0,{"$f":"IFERROR(BB13*100/SUM(BB4:BB15), 0)","v":0},{"$f":"IF((BB13>0),RANK(BB13,BB4:BB15,0),\"SIN RANGO\")","v":"SIN RANGO"},null,1,{"$f":"IFERROR(STDEV(IF(C13:AZ13<>1, C13:AZ13, \"\")), 0)","v":0},{"$f":"IFERROR(MEDIAN(IF(C13:AZ13<>1, C13:AZ13, \"\")), 1)","v":1},"SIN RANGO",null,{"$f":"BB13","v":0}]
[null,{"$f":"User01!B23","v":"ESPERANZA"},{"$f":"User01!H57","v":1},{"$f":"User02!$H57","v":1},{"$f":"User03!$H57","v":1},{"$f":"User04!$H57","v":1},{"$f":"User05!$H57","v":1},{"$f":"User06!$H57","v":1},{"$f":"User07!$H57","v":1},{"$f":"User08!$H57","v":1},{"$f":"User09!$H57","v":1},{"$f":"User10!$H57","v":1},{"$f":"User11!$H57","v":1},{"$f":"User12!$H57","v":1},{"$f":"User13!$H57","v":1},{"$f":"User14!$H57","v":1},{"$f":"User15!$H57","v":1},{"$f":"User16!$H57","v":1},{"$f":"User17!$H57","v":1},{"$f":"User18!$H57","v":1},{"$f":"User19!$H57","v":1},{"$f":"User20!$H57","v":1},{"$f":"User21!$H57","v":1},{"$f":"User22!$H57","v":1},{"$f":"User23!$H57","v":1},{"$f":"User24!$H57","v":1},{"$f":"User25!$H57","v":1},{"$f":"User26!$H57","v":1},{"$f":"User27!$H57","v":1},{"$f":"User28!$H57","v":1},{"$f":"User29!$H57","v":1},{"$f":"User30!$H57","v":1},{"$f":"User31!$H57","v":1},{"$f":"User32!$H57","v":1},{"$f":"User33!$H57","v":1},{"$f":"User34!$H57","v":1},{"$f":"User35!$H57","v":1},{"$f":"User36!$H57","v":1},{"$f":"User37!$H57","v":1},{"$f":"User38!$H57","v":1},{"$f":"User39!$H57","v":1},{"$f":"User40!$H57","v":1},{"$f":"User41!$H57","v":1},{"$f":"User42!$H57","v":1},{"$f":"User43!$H57","v":1},{"$f":"User44!$H57","v":1},{"$f":"User45!$H57","v":1},{"$f":"User46!$H57","v":1},{"$f":"User47!$H57","v":1},{"$f":"User48!$H57","v":1},{"$f":"User49!$H57","v":1},{"$f":"User50!$H57","v":1},null,0,{"$f":"IFERROR(BB14*100/SUM(BB4:BB15), 0)","v":0},{"$f":"IF((BB14>0),RANK(BB14,BB4:BB15,0),\"SIN RANGO\")","v":"SIN RANGO"},null,1,{"$f":"IFERROR(STDEV(IF(C14:AZ14<>1, C14:AZ14, \"\")), 0)","v":0},{"$f":"IFERROR(MEDIAN(IF(C14:AZ14<>1, C14:AZ14, \"\")), 1)","v":1},"SIN RANGO",null,{"$f":"BB14","v":0}]
[null,{"$f":"User01!B24","v":"ORGULLO"},{"$f":"User01!H58","v":1},{"$f":"User02!$H58","v":1},{"$f":"User03!$H58","v":1},{"$f":"User04!$H58","v":1},{"$f":"User05!$H58","v":1},{"$f":"User06!$H58","v":1},{"$f":"User07!$H58","v":1},{"$f":"User08!$H58","v":1},{"$f":"User09!$H58","v":1},{"$f":"User10!$H58","v":1},{"$f":"User11!$H58","v":1},{"$f":"User12!$H58","v":1},{"$f":"User13!$H58","v":1},{"$f":"User14!$H58","v":1},{"$f":"User15!$H58","v":1},{"$f":"User16!$H58","v":1},{"$f":"User17!$H58","v":1},{"$f":"User18!$H58","v":1},{"$f":"User19!$H58","v":1},{"$f":"User20!$H58","v":1},{"$f":"User21!$H58","v":1},{"$f":"User22!$H58","v":1},{"$f":"User23!$H58","v":1},{"$f":"User24!$H58","v":1},{"$f":"User25!$H58","v":1},{"$f":"User26!$H58","v":1},{"$f":"User27!$H58","v":1},{"$f":"User28!$H58","v":1},{"$f":"User29!$H58","v":1},{"$f":"User30!$H58","v":1},{"$f":"User31!$H58","v":1},{"$f":"User32!$H58","v":1},{"$f":"User33!$H58","v":1},{"$f":"User34!$H58","v":1},{"$f":"User35!$H58","v":1},{"$f":"User36!$H58","v":1},{"$f":"User37!$H58","v":1},{"$f":"User38!$H58","v":1},{"$f":"User39!$H58","v":1},{"$f":"User40!$H58","v":1},{"$f":"User41!$H58","v":1},{"$f":"User42!$H58","v":1},{"$f":"User43!$H58","v":1},{"$f":"User44!$H58","v":1},{"$f":"User45!$H58","v":1},{"$f":"User46!$H58","v":1},{"$f":"User47!$H58","v":1},{"$f":"User48!$H58","v":1},{"$f":"User49!$H58","v":1},{"$f":"User50!$H58","v":1},null,0,{"$f":"IFERROR(BB15*100/SUM(BB4:BB15), 0)","v":0},{"$f":"IF((BB15>0),RANK(BB15,BB4:BB15,0),\"SIN RANGO\")","v":"SIN RANGO"},null,1,{"$f":"IFERROR(STDEV(IF(C15:AZ15<>1, C15:AZ15, \"\")), 0)","v":0},{"$f":"IFERROR(MEDIAN(IF(C15:AZ15<>1, C15:AZ15, \"\")), 1)","v":1},"SIN RANGO",null,0]
[]
[null,null,null,null,null,null,null,null,null,null,null,null,null,null,null,null,null,null,null,null,null,null,null,null,null,null,null,null,null,null,null,null,null,null,null,null,null,null,null,null,null,null,null,null,null,null,null,null,null,null,null,null,null,null,null,null,null,null,null,null,null,null,{"$f":"SUM(BK4:BK15)","v":0},{"$f":"SUM(BL7:BL12)","v":0},"MENCIONES"]
[null,null,null,null,null,null,null,null,null,null,null,null,null,null,null,null,null,null,null,null,null,null,null,null,null,null,null,null,null,null,null,null,null,null,null,null,null,null,null,null,null,null,null,null,null,null,null,null,null,null,null,null,null,null,null,null,null,null,null,null,null,null,{"$f":"IFERROR(BK17*100/(SUM(BK17:BL17)), 0)","v":0},{"$f":"IFERROR(BL17*100/(SUM(BK17:BL17)), 0)","v":0},"PORCENTAJES"]

{"sheet":"ItemD","index":54,"n_rows":18,"n_cols":65,"rows_kept":18,"cut":false,"hidden":false,"merged":[[1,63,2,63],[1,49,2,49],[1,50,2,50],[1,51,2,51],[1,53,2,53],[1,54,2,54],[1,55,2,55],[1,57,2,57],[1,58,2,58],[1,59,2,59],[1,60,2,60],[1,62,2,62],[1,48,2,48],[1,37,2,37],[1,38,2,38],[1,39,2,39],[1,40,2,40],[1,41,2,41],[1,42,2,42],[1,43,2,43],[1,44,2,44],[1,45,2,45],[1,46,2,46],[1,47,2,47],[1,36,2,36],[1,25,2,25],[1,26,2,26],[1,27,2,27],[1,28,2,28],[1,29,2,29],[1,30,2,30],[1,31,2,31],[1,32,2,32],[1,33,2,33],[1,34,2,34],[1,35,2,35],[1,24,2,24],[1,13,2,13],[1,14,2,14],[1,15,2,15],[1,16,2,16],[1,17,2,17],[1,18,2,18],[1,19,2,19],[1,20,2,20],[1,21,2,21],[1,22,2,22],[1,23,2,23],[1,12,2,12],[1,1,2,1],[1,2,2,2],[1,3,2,3],[1,4,2,4],[1,5,2,5],[1,6,2,6],[1,7,2,7],[1,8,2,8],[1,9,2,9],[1,10,2,10],[1,11,2,11]]}
[]
[null,"EMOCIONES/USUARIOS",1,2,3,4,5,6,7,8,9,10,11,12,13,14,15,16,17,18,19,20,21,22,23,24,25,26,27,28,29,30,31,32,33,34,35,36,37,38,39,40,41,42,43,44,45,46,47,48,49,50,null,"FRECUENCIA","% DE MENCIÓN","JERARQUÍA FRECUENCIA (MEDIA)",null,"MEDIA DE INTENSIDAD","DESVIACION ESTÁNDAR","MEDIANA DE INTENSIDAD","JERARQUÍA INTENSIDAD (MEDIA)",null,"POSITIVAS","NEGATIVAS"]
[]
[null,{"$f":"User01!B13","v":"ALEGRÍA"},{"$f":"User01!$H65","v":1},{"$f":"User02!$H65","v":1},{"$f":"User03!$H65","v":1},{"$f":"User04!$H65","v":1},{"$f":"User05!$H65","v":1},{"$f":"User06!$H65","v":1},{"$f":"User07!$H65","v":1},{"$f":"User08!$H65","v":1},{"$f":"User09!$H65","v":1},{"$f":"User10!$H65","v":1},{"$f":"User11!$H65","v":1},{"$f":"User12!$H65","v":1},{"$f":"User13!$H65","v":1},{"$f":"User14!$H65","v":1},{"$f":"User15!$H65","v":1},{"$f":"User16!$H65","v":1},{"$f":"User17!$H65","v":1},{"$f":"User18!$H65","v":1},{"$f":"User19!$H65","v":1},{"$f":"User20!$H65","v":1},{"$f":"User21!$H65","v":1},{"$f":"User22!$H65","v":1},{"$f":"User23!$H65","v":1},{"$f":"User24!$H65","v":1},{"$f":"User25!$H65","v":1},{"$f":"User26!$H65","v":1},{"$f":"User27!$H65","v":1},{"$f":"User28!$H65","v":1},{"$f":"User29!$H65","v":1},{"$f":"User30!$H65","v":1},{"$f":"User31!$H65","v":1},{"$f":"User32!$H65","v":1},{"$f":"User33!$H65","v":1},{"$f":"User34!$H65","v":1},{"$f":"User35!$H65","v":1},{"$f":"User36!$H65","v":1},{"$f":"User37!$H65","v":1},{"$f":"User38!$H65","v":1},{"$f":"User39!$H65","v":1},{"$f":"User40!$H65","v":1},{"$f":"User41!$H65","v":1},{"$f":"User42!$H65","v":1},{"$f":"User43!$H65","v":1},{"$f":"User44!$H65","v":1},{"$f":"User45!$H65","v":1},{"$f":"User46!$H65","v":1},{"$f":"User47!$H65","v":1},{"$f":"User48!$H65","v":1},{"$f":"User49!$H65","v":1},{"$f":"User50!$H65","v":1},null,{"$f":"COUNTIF(C4:AZ4, \"<>1\")","v":0},{"$f":"IFERROR(BB4*100/SUM(BB4:BB15), 0)","v":0},{"$f":"IF((BB4>0),RANK(BB4,BB4:BB15,0),\"SIN RANGO\")","v":"SIN RANGO"},null,{"$f":"IFERROR(AVERAGEIF(C4:AZ4, \">1\"), 1)","v":1},{"$f":"IFERROR(STDEV(IF(C4:AZ4<>1, C4:AZ4, \"\")), 0)","v":0},{"$f":"IFERROR(MEDIAN(IF(C4:AZ4<>1, C4:AZ4, \"\")), 1)","v":1},{"$f":"IF((BF4>1),RANK(BF4,$BF$4:$BF$15,0),\"SIN RANGO\")","v":"SIN RANGO"},null,{"$f":"BB4","v":0}]
[null,{"$f":"User01!B14","v":"SATISFACCIÓN"},{"$f":"User01!$H66","v":1},{"$f":"User02!$H66","v":1},{"$f":"User03!$H66","v":1},{"$f":"User04!$H66","v":1},{"$f":"User05!$H66","v":1},{"$f":"User06!$H66","v":1},{"$f":"User07!$H66","v":1},{"$f":"User08!$H66","v":1},{"$f":"User09!$H66","v":1},{"$f":"User10!$H66","v":1},{"$f":"User11!$H66","v":1},{"$f":"User12!$H66","v":1},{"$f":"User13!$H66","v":1},{"$f":"User14!$H66","v":1},{"$f":"User15!$H66","v":1},{"$f":"User16!$H66","v":1},{"$f":"User17!$H66","v":1},{"$f":"User18!$H66","v":1},{"$f":"User19!$H66","v":1},{"$f":"User20!$H66","v":1},{"$f":"User21!$H66","v":1},{"$f":"User22!$H66","v":1},{"$f":"User23!$H66","v":1},{"$f":"User24!$H66","v":1},{"$f":"User25!$H66","v":1},{"$f":"User26!$H66","v":1},{"$f":"User27!$H66","v":1},{"$f":"User28!$H66","v":1},{"$f":"User29!$H66","v":1},{"$f":"User30!$H66","v":1},{"$f":"User31!$H66","v":1},{"$f":"User32!$H66","v":1},{"$f":"User33!$H66","v":1},{"$f":"User34!$H66","v":1},{"$f":"User35!$H66","v":1},{"$f":"User36!$H66","v":1},{"$f":"User37!$H66","v":1},{"$f":"User38!$H66","v":1},{"$f":"User39!$H66","v":1},{"$f":"User40!$H66","v":1},{"$f":"User41!$H66","v":1},{"$f":"User42!$H66","v":1},{"$f":"User43!$H66","v":1},{"$f":"User44!$H66","v":1},{"$f":"User45!$H66","v":1},{"$f":"User46!$H66","v":1},{"$f":"User47!$H66","v":1},{"$f":"User48!$H66","v":1},{"$f":"User49!$H66","v":1},{"$f":"User50!$H66","v":1},null,{"$f":"COUNTIF(C5:AZ5, \"<>1\")","v":0},{"$f":"IFERROR(BB5*100/SUM(BB4:BB15), 0)","v":0},{"$f":"IF((BB5>0),RANK(BB5,BB4:BB15,0),\"SIN RANGO\")","v":"SIN RANGO"},null,{"$f":"IFERROR(AVERAGEIF(C5:AZ5, \">1\"), 1)","v":1},{"$f":"IFERROR(STDEV(IF(C5:AZ5<>1, C5:AZ5, \"\")), 0)","v":0},{"$f":"IFERROR(MEDIAN(IF(C5:AZ5<>1, C5:AZ5, \"\")), 1)","v":1},{"$f":"IF((BF5>1),RANK(BF5,$BF$4:$BF$15,0),\"SIN RANGO\")","v":"SIN RANGO"},null,{"$f":"BB5","v":0}]
[null,{"$f":"User01!B15","v":"FASCINACIÓN"},{"$f":"User01!$H67","v":1},{"$f":"User02!$H67","v":1},{"$f":"User03!$H67","v":1},{"$f":"User04!$H67","v":1},{"$f":"User05!$H67","v":1},{"$f":"User06!$H67","v":1},{"$f":"User07!$H67","v":1},{"$f":"User08!$H67","v":1},{"$f":"User09!$H67","v":1},{"$f":"User10!$H67","v":1},{"$f":"User11!$H67","v":1},{"$f":"User12!$H67","v":1},{"$f":"User13!$H67","v":1},{"$f":"User14!$H67","v":1},{"$f":"User15!$H67","v":1},{"$f":"User16!$H67","v":1},{"$f":"User17!$H67","v":1},{"$f":"User18!$H67","v":1},{"$f":"User19!$H67","v":1},{"$f":"User20!$H67","v":1},{"$f":"User21!$H67","v":1},{"$f":"User22!$H67","v":1},{"$f":"User23!$H67","v":1},{"$f":"User24!$H67","v":1},{"$f":"User25!$H67","v":1},{"$f":"User26!$H67","v":1},{"$f":"User27!$H67","v":1},{"$f":"User28!$H67","v":1},{"$f":"User29!$H67","v":1},{"$f":"User30!$H67","v":1},{"$f":"User31!$H67","v":1},{"$f":"User32!$H67","v":1},{"$f":"User33!$H67","v":1},{"$f":"User34!$H67","v":1},{"$f":"User35!$H67","v":1},{"$f":"User36!$H67","v":1},{"$f":"User37!$H67","v":1},{"$f":"User38!$H67","v":1},{"$f":"User39!$H67","v":1},{"$f":"User40!$H67","v":1},{"$f":"User41!$H67","v":1},{"$f":"User42!$H67","v":1},{"$f":"User43!$H67","v":1},{"$f":"User44!$H67","v":1},{"$f":"User45!$H67","v":1},{"$f":"User46!$H67","v":1},{"$f":"User47!$H67","v":1},{"$f":"User48!$H67","v":1},{"$f":"User49!$H67","v":1},{"$f":"User50!$H67","v":1},null,0,{"$f":"IFERROR(BB6*100/SUM(BB4:BB15), 0)","v":0},{"$f":"IF((BB6>0),RANK(BB6,BB4:BB15,0),\"SIN RANGO\")","v":"SIN RANGO"},null,1,{"$f":"IFERROR(STDEV(IF(C6:AZ6<>1, C6:AZ6, \"\")), 0)","v":0},{"$f":"IFERROR(MEDIAN(IF(C6:AZ6<>1, C6:AZ6, \"\")), 1)","v":1},"SIN RANGO",null,0]
[null,{"$f":"User01!B16","v":"ABURRIMIENTO"},{"$f":"User01!$H68","v":1},{"$f":"User02!$H68","v":1},{"$f":"User03!$H68","v":1},{"$f":"User04!$H68","v":1},{"$f":"User05!$H68","v":1},{"$f":"User06!$H68","v":1},{"$f":"User07!$H68","v":1},{"$f":"User08!$H68","v":1},{"$f":"User09!$H68","v":1},{"$f":"User10!$H68","v":1},{"$f":"User11!$H68","v":1},{"$f":"User12!$H68","v":1},{"$f":"User13!$H68","v":1},{"$f":"User14!$H68","v":1},{"$f":"User15!$H68","v":1},{"$f":"User16!$H68","v":1},{"$f":"User17!$H68","v":1},{"$f":"User18!$H68","v":1},{"$f":"User19!$H68","v":1},{"$f":"User20!$H68","v":1},{"$f":"User21!$H68","v":1},{"$f":"User22!$H68","v":1},{"$f":"User23!$H68","v":1},{"$f":"User24!$H68","v":1},{"$f":"User25!$H68","v":1},{"$f":"User26!$H68","v":1},{"$f":"User27!$H68","v":1},{"$f":"User28!$H68","v":1},{"$f":"User29!$H68","v":1},{"$f":"User30!$H68","v":1},{"$f":"User31!$H68","v":1},{"$f":"User32!$H68","v":1},{"$f":"User33!$H68","v":1},{"$f":"User34!$H68","v":1},{"$f":"User35!$H68","v":1},{"$f":"User36!$H68","v":1},{"$f":"User37!$H68","v":1},{"$f":"User38!$H68","v":1},{"$f":"User39!$H68","v":1},{"$f":"User40!$H68","v":1},{"$f":"User41!$H68","v":1},{"$f":"User42!$H68","v":1},{"$f":"User43!$H68","v":1},{"$f":"User44!$H68","v":1},{"$f":"User45!$H68","v":1},{"$f":"User46!$H68","v":1},{"$f":"User47!$H68","v":1},{"$f":"User48!$H68","v":1},{"$f":"User49!$H68","v":1},{"$f":"User50!$H68","v":1},null,0,{"$f":"IFERROR(BB7*100/SUM(BB4:BB15), 0)","v":0},{"$f":"IF((BB7>0),RANK(BB7,BB4:BB15,0),\"SIN RANGO\")","v":"SIN RANGO"},null,1,{"$f":"IFERROR(STDEV(IF(C7:AZ7<>1, C7:AZ7, \"\")), 0)","v":0},{"$f":"IFERROR(MEDIAN(IF(C7:AZ7<>1, C7:AZ7, \"\")), 1)","v":1},"SIN RANGO",null,null,{"$f":"BB7:BB12","v":0}]
[null,{"$f":"User01!B17","v":"ENFADO"},{"$f":"User01!$H69","v":1},{"$f":"User02!$H69","v":1},{"$f":"User03!$H69","v":1},{"$f":"User04!$H69","v":1},{"$f":"User05!$H69","v":1},{"$f":"User06!$H69","v":1},{"$f":"User07!$H69","v":1},{"$f":"User08!$H69","v":1},{"$f":"User09!$H69","v":1},{"$f":"User10!$H69","v":1},{"$f":"User11!$H69","v":1},{"$f":"User12!$H69","v":1},{"$f":"User13!$H69","v":1},{"$f":"User14!$H69","v":1},{"$f":"User15!$H69","v":1},{"$f":"User16!$H69","v":1},{"$f":"User17!$H69","v":1},{"$f":"User18!$H69","v":1},{"$f":"User19!$H69","v":1},{"$f":"User20!$H69","v":1},{"$f":"User21!$H69","v":1},{"$f":"User22!$H69","v":1},{"$f":"User23!$H69","v":1},{"$f":"User24!$H69","v":1},{"$f":"User25!$H69","v":1},{"$f":"User26!$H69","v":1},{"$f":"User27!$H69","v":1},{"$f":"User28!$H69","v":1},{"$f":"User29!$H69","v":1},{"$f":"User30!$H69","v":1},{"$f":"User31!$H69","v":1},{"$f":"User32!$H69","v":1},{"$f":"User33!$H69","v":1},{"$f":"User34!$H69","v":1},{"$f":"User35!$H69","v":1},{"$f":"User36!$H69","v":1},{"$f":"User37!$H69","v":1},{"$f":"User38!$H69","v":1},{"$f":"User39!$H69","v":1},{"$f":"User40!$H69","v":1},{"$f":"User41!$H69","v":1},{"$f":"User42!$H69","v":1},{"$f":"User43!$H69","v":1},{"$f":"User44!$H69","v":1},{"$f":"User45!$H69","v":1},{"$f":"User46!$H69","v":1},{"$f":"User47!$H69","v":1},{"$f":"User48!$H69","v":1},{"$f":"User49!$H69","v":1},{"$f":"User50!$H69","v":1},null,0,{"$f":"IFERROR(BB8*100/SUM(BB4:BB15), 0)","v":0},{"$f":"IF((BB8>0),RANK(BB8,BB4:BB15,0),\"SIN RANGO\")","v":"SIN RANGO"},null,1,{"$f":"IFERROR(STDEV(IF(C8:AZ8<>1, C8:AZ8, \"\")), 0)","v":0},{"$f":"IFERROR(MEDIAN(IF(C8:AZ8<>1, C8:AZ8, \"\")), 1)","v":1},"SIN RANGO",null,null,{"$f":"BB8:BB13","v":0}]
[null,{"$f":"User01!B18","v":"TRISTEZA"},{"$f":"User01!$H70","v":1},{"$f":"User02!$H70","v":1},{"$f":"User03!$H70","v":1},{"$f":"User04!$H70","v":1},{"$f":"User05!$H70","v":1},{"$f":"User06!$H70","v":1},{"$f":"User07!$H70","v":1},{"$f":"User08!$H70","v":1},{"$f":"User09!$H70","v":1},{"$f":"User10!$H70","v":1},{"$f":"User11!$H70","v":1},{"$f":"User12!$H70","v":1},{"$f":"User13!$H70","v":1},{"$f":"User14!$H70","v":1},{"$f":"User15!$H70","v":1},{"$f":"User16!$H70","v":1},{"$f":"User17!$H70","v":1},{"$f":"User18!$H70","v":1},{"$f":"User19!$H70","v":1},{"$f":"User20!$H70","v":1},{"$f":"User21!$H70","v":1},{"$f":"User22!$H70","v":1},{"$f":"User23!$H70","v":1},{"$f":"User24!$H70","v":1},{"$f":"User25!$H70","v":1},{"$f":"User26!$H70","v":1},{"$f":"User27!$H70","v":1},{"$f":"User28!$H70","v":1},{"$f":"User29!$H70","v":1},{"$f":"User30!$H70","v":1},{"$f":"User31!$H70","v":1},{"$f":"User32!$H70","v":1},{"$f":"User33!$H70","v":1},{"$f":"User34!$H70","v":1},{"$f":"User35!$H70","v":1},{"$f":"User36!$H70","v":1},{"$f":"User37!$H70","v":1},{"$f":"User38!$H70","v":1},{"$f":"User39!$H70","v":1},{"$f":"User40!$H70","v":1},{"$f":"User41!$H70","v":1},{"$f":"User42!$H70","v":1},{"$f":"User43!$H70","v":1},{"$f":"User44!$H70","v":1},{"$f":"User45!$H70","v":1},{"$f":"User46!$H70","v":1},{"$f":"User47!$H70","v":1},{"$f":"User48!$H70","v":1},{"$f":"User49!$H70","v":1},{"$f":"User50!$H70","v":1},null,0,{"$f":"IFERROR(BB9*100/SUM(BB4:BB15), 0)","v":0},{"$f":"IF((BB9>0),RANK(BB9,BB4:BB15,0),\"SIN RANGO\")","v":"SIN RANGO"},null,1,{"$f":"IFERROR(STDEV(IF(C9:AZ9<>1, C9:AZ9, \"\")), 0)","v":0},{"$f":"IFERROR(MEDIAN(IF(C9:AZ9<>1, C9:AZ9, \"\")), 1)","v":1},"SIN RANGO",null,null,0]
[null,{"$f":"User01!B19","v":"VERGÜENZA"},{"$f":"User01!$H71","v":1},{"$f":"User02!$H71","v":1},{"$f":"User03!$H71","v":1},{"$f":"User04!$H71","v":1},{"$f":"User05!$H71","v":1},{"$f":"User06!$H71","v":1},{"$f":"User07!$H71","v":1},{"$f":"User08!$H71","v":1},{"$f":"User09!$H71","v":1},{"$f":"User10!$H71","v":1},{"$f":"User11!$H71","v":1},{"$f":"User12!$H71","v":1},{"$f":"User13!$H71","v":1},{"$f":"User14!$H71","v":1},{"$f":"User15!$H71","v":1},{"$f":"User16!$H71","v":1},{"$f":"User17!$H71","v":1},{"$f":"User18!$H71","v":1},{"$f":"User19!$H71","v":1},{"$f":"User20!$H71","v":1},{"$f":"User21!$H71","v":1},{"$f":"User22!$H71","v":1},{"$f":"User23!$H71","v":1},{"$f":"User24!$H71","v":1},{"$f":"User25!$H71","v":1},{"$f":"User26!$H71","v":1},{"$f":"User27!$H71","v":1},{"$f":"User28!$H71","v":1},{"$f":"User29!$H71","v":1},{"$f":"User30!$H71","v":1},{"$f":"User31!$H71","v":1},{"$f":"User32!$H71","v":1},{"$f":"User33!$H71","v":1},{"$f":"User34!$H71","v":1},{"$f":"User35!$H71","v":1},{"$f":"User36!$H71","v":1},{"$f":"User37!$H71","v":1},{"$f":"User38!$H71","v":1},{"$f":"User39!$H71","v":1},{"$f":"User40!$H71","v":1},{"$f":"User41!$H71","v":1},{"$f":"User42!$H71","v":1},{"$f":"User43!$H71","v":1},{"$f":"User44!$H71","v":1},{"$f":"User45!$H71","v":1},{"$f":"User46!$H71","v":1},{"$f":"User47!$H71","v":1},{"$f":"User48!$H71","v":1},{"$f":"User49!$H71","v":1},{"$f":"User50!$H71","v":1},null,0,{"$f":"IFERROR(BB10*100/SUM(BB4:BB15), 0)","v":0},{"$f":"IF((BB10>0),RANK(BB10,BB4:BB15,0),\"SIN RANGO\")","v":"SIN RANGO"},null,1,{"$f":"IFERROR(STDEV(IF(C10:AZ10<>1, C10:AZ10, \"\")), 0)","v":0},{"$f":"IFERROR(MEDIAN(IF(C10:AZ10<>1, C10:AZ10, \"\")), 1)","v":1},"SIN RANGO",null,null,{"$f":"BB10:BB15","v":0}]
[null,{"$f":"User01!B20","v":"MIEDO"},{"$f":"User01!$H72","v":1},{"$f":"User02!$H72","v":1},{"$f":"User03!$H72","v":1},{"$f":"User04!$H72","v":1},{"$f":"User05!$H72","v":1},{"$f":"User06!$H72","v":1},{"$f":"User07!$H72","v":1},{"$f":"User08!$H72","v":1},{"$f":"User09!$H72","v":1},{"$f":"User10!$H72","v":1},{"$f":"User11!$H72","v":1},{"$f":"User12!$H72","v":1},{"$f":"User13!$H72","v":1},{"$f":"User14!$H72","v":1},{"$f":"User15!$H72","v":1},{"$f":"User16!$H72","v":1},{"$f":"User17!$H72","v":1},{"$f":"User18!$H72","v":1},{"$f":"User19!$H72","v":1},{"$f":"User20!$H72","v":1},{"$f":"User21!$H72","v":1},{"$f":"User22!$H72","v":1},{"$f":"User23!$H72","v":1},{"$f":"User24!$H72","v":1},{"$f":"User25!$H72","v":1},{"$f":"User26!$H72","v":1},{"$f":"User27!$H72","v":1},{"$f":"User28!$H72","v":1},{"$f":"User29!$H72","v":1},{"$f":"User30!$H72","v":1},{"$f":"User31!$H72","v":1},{"$f":"User32!$H72","v":1},{"$f":"User33!$H72","v":1},{"$f":"User34!$H72","v":1},{"$f":"User35!$H72","v":1},{"$f":"User36!$H72","v":1},{"$f":"User37!$H72","v":1},{"$f":"User38!$H72","v":1},{"$f":"User39!$H72","v":1},{"$f":"User40!$H72","v":1},{"$f":"User41!$H72","v":1},{"$f":"User42!$H72","v":1},{"$f":"User43!$H72","v":1},{"$f":"User44!$H72","v":1},{"$f":"User45!$H72","v":1},{"$f":"User46!$H72","v":1},{"$f":"User47!$H72","v":1},{"$f":"User48!$H72","v":1},{"$f":"User49!$H72","v":1},{"$f":"User50!$H72","v":1},null,0,{"$f":"IFERROR(BB11*100/SUM(BB4:BB15), 0)","v":0},{"$f":"IF((BB11>0),RANK(BB11,BB4:BB15,0),\"SIN RANGO\")","v":"SIN RANGO"},null,1,{"$f":"IFERROR(STDEV(IF(C11:AZ11<>1, C11:AZ11, \"\")), 0)","v":0},{"$f":"IFERROR(MEDIAN(IF(C11:AZ11<>1, C11:AZ11, \"\")), 1)","v":1},"SIN RANGO",null,null,{"$f":"BB11:BB17","v":0}]
[null,{"$f":"User01!B21","v":"REPUGNANCIA"},{"$f":"User01!$H73","v":1},{"$f":"User02!$H73","v":1},{"$f":"User03!$H73","v":1},{"$f":"User04!$H73","v":1},{"$f":"User05!$H73","v":1},{"$f":"User06!$H73","v":1},{"$f":"User07!$H73","v":1},{"$f":"User08!$H73","v":1},{"$f":"User09!$H73","v":1},{"$f":"User10!$H73","v":1},{"$f":"User11!$H73","v":1},{"$f":"User12!$H73","v":1},{"$f":"User13!$H73","v":1},{"$f":"User14!$H73","v":1},{"$f":"User15!$H73","v":1},{"$f":"User16!$H73","v":1},{"$f":"User17!$H73","v":1},{"$f":"User18!$H73","v":1},{"$f":"User19!$H73","v":1},{"$f":"User20!$H73","v":1},{"$f":"User21!$H73","v":1},{"$f":"User22!$H73","v":1},{"$f":"User23!$H73","v":1},{"$f":"User24!$H73","v":1},{"$f":"User25!$H73","v":1},{"$f":"User26!$H73","v":1},{"$f":"User27!$H73","v":1},{"$f":"User28!$H73","v":1},{"$f":"User29!$H73","v":1},{"$f":"User30!$H73","v":1},{"$f":"User31!$H73","v":1},{"$f":"User32!$H73","v":1},{"$f":"User33!$H73","v":1},{"$f":"User34!$H73","v":1},{"$f":"User35!$H73","v":1},{"$f":"User36!$H73","v":1},{"$f":"User37!$H73","v":1},{"$f":"User38!$H73","v":1},{"$f":"User39!$H73","v":1},{"$f":"User40!$H73","v":1},{"$f":"User41!$H73","v":1},{"$f":"User42!$H73","v":1},{"$f":"User43!$H73","v":1},{"$f":"User44!$H73","v":1},{"$f":"User45!$H73","v":1},{"$f":"User46!$H73","v":1},{"$f":"User47!$H73","v":1},{"$f":"User48!$H73","v":1},{"$f":"User49!$H73","v":1},{"$f":"User50!$H73","v":1},null,0,{"$f":"IFERROR(BB12*100/SUM(BB4:BB15), 0)","v":0},{"$f":"IF((BB12>0),RANK(BB12,BB4:BB15,0),\"SIN RANGO\")","v":"SIN RANGO"},null,1,{"$f":"IFERROR(STDEV(IF(C12:AZ12<>1, C12:AZ12, \"\")), 0)","v":0},{"$f":"IFERROR(MEDIAN(IF(C12:AZ12<>1, C12:AZ12, \"\")), 1)","v":1},"SIN RANGO",null,null,{"$f":"BB12:BB18","v":0}]
[null,{"$f":"User01!B22","v":"DESEO"},{"$f":"User01!$H74","v":1},{"$f":"User02!$H74","v":1},{"$f":"User03!$H74","v":1},{"$f":"User04!$H74","v":1},{"$f":"User05!$H74","v":1},{"$f":"User06!$H74","v":1},{"$f":"User07!$H74","v":1},{"$f":"User08!$H74","v":1},{"$f":"User09!$H74","v":1},{"$f":"User10!$H74","v":1},{"$f":"User11!$H74","v":1},{"$f":"User12!$H74","v":1},{"$f":"User13!$H74","v":1},{"$f":"User14!$H74","v":1},{"$f":"User15!$H74","v":1},{"$f":"User16!$H74","v":1},{"$f":"User17!$H74","v":1},{"$f":"User18!$H74","v":1},{"$f":"User19!$H74","v":1},{"$f":"User20!$H74","v":1},{"$f":"User21!$H74","v":1},{"$f":"User22!$H74","v":1},{"$f":"User23!$H74","v":1},{"$f":"User24!$H74","v":1},{"$f":"User25!$H74","v":1},{"$f":"User26!$H74","v":1},{"$f":"User27!$H74","v":1},{"$f":"User28!$H74","v":1},{"$f":"User29!$H74","v":1},{"$f":"User30!$H74","v":1},{"$f":"User31!$H74","v":1},{"$f":"User32!$H74","v":1},{"$f":"User33!$H74","v":1},{"$f":"User34!$H74","v":1},{"$f":"User35!$H74","v":1},{"$f":"User36!$H74","v":1},{"$f":"User37!$H74","v":1},{"$f":"User38!$H74","v":1},{"$f":"User39!$H74","v":1},{"$f":"User40!$H74","v":1},{"$f":"User41!$H74","v":1},{"$f":"User42!$H74","v":1},{"$f":"User43!$H74","v":1},{"$f":"User44!$H74","v":1},{"$f":"User45!$H74","v":1},{"$f":"User46!$H74","v":1},{"$f":"User47!$H74","v":1},{"$f":"User48!$H74","v":1},{"$f":"User49!$H74","v":1},{"$f":"User50!$H74","v":1},null,0,{"$f":"IFERROR(BB13*100/SUM(BB4:BB15), 0)","v":0},{"$f":"IF((BB13>0),RANK(BB13,BB4:BB15,0),\"SIN RANGO\")","v":"SIN RANGO"},null,1,{"$f":"IFERROR(STDEV(IF(C13:AZ13<>1, C13:AZ13, \"\")), 0)","v":0},{"$f":"IFERROR(MEDIAN(IF(C13:AZ13<>1, C13:AZ13, \"\")), 1)","v":1},"SIN RANGO",null,{"$f":"BB13","v":0}]
[null,{"$f":"User01!B23","v":"ESPERANZA"},{"$f":"User01!$H75","v":1},{"$f":"User02!$H75","v":1},{"$f":"User03!$H75","v":1},{"$f":"User04!$H75","v":1},{"$f":"User05!$H75","v":1},{"$f":"User06!$H75","v":1},{"$f":"User07!$H75","v":1},{"$f":"User08!$H75","v":1},{"$f":"User09!$H75","v":1},{"$f":"User10!$H75","v":1},{"$f":"User11!$H75","v":1},{"$f":"User12!$H75","v":1},{"$f":"User13!$H75","v":1},{"$f":"User14!$H75","v":1},{"$f":"User15!$H75","v":1},{"$f":"User16!$H75","v":1},{"$f":"User17!$H75","v":1},{"$f":"User18!$H75","v":1},{"$f":"User19!$H75","v":1},{"$f":"User20!$H75","v":1},{"$f":"User21!$H75","v":1},{"$f":"User22!$H75","v":1},{"$f":"User23!$H75","v":1},{"$f":"User24!$H75","v":1},{"$f":"User25!$H75","v":1},{"$f":"User26!$H75","v":1},{"$f":"User27!$H75","v":1},{"$f":"User28!$H75","v":1},{"$f":"User29!$H75","v":1},{"$f":"User30!$H75","v":1},{"$f":"User31!$H75","v":1},{"$f":"User32!$H75","v":1},{"$f":"User33!$H75","v":1},{"$f":"User34!$H75","v":1},{"$f":"User35!$H75","v":1},{"$f":"User36!$H75","v":1},{"$f":"User37!$H75","v":1},{"$f":"User38!$H75","v":1},{"$f":"User39!$H75","v":1},{"$f":"User40!$H75","v":1},{"$f":"User41!$H75","v":1},{"$f":"User42!$H75","v":1},{"$f":"User43!$H75","v":1},{"$f":"User44!$H75","v":1},{"$f":"User45!$H75","v":1},{"$f":"User46!$H75","v":1},{"$f":"User47!$H75","v":1},{"$f":"User48!$H75","v":1},{"$f":"User49!$H75","v":1},{"$f":"User50!$H75","v":1},null,0,{"$f":"IFERROR(BB14*100/SUM(BB4:BB15), 0)","v":0},{"$f":"IF((BB14>0),RANK(BB14,BB4:BB15,0),\"SIN RANGO\")","v":"SIN RANGO"},null,1,{"$f":"IFERROR(STDEV(IF(C14:AZ14<>1, C14:AZ14, \"\")), 0)","v":0},{"$f":"IFERROR(MEDIAN(IF(C14:AZ14<>1, C14:AZ14, \"\")), 1)","v":1},"SIN RANGO",null,{"$f":"BB14","v":0}]
[null,{"$f":"User01!B24","v":"ORGULLO"},{"$f":"User01!$H76","v":1},{"$f":"User02!$H76","v":1},{"$f":"User03!$H76","v":1},{"$f":"User04!$H76","v":1},{"$f":"User05!$H76","v":1},{"$f":"User06!$H76","v":1},{"$f":"User07!$H76","v":1},{"$f":"User08!$H76","v":1},{"$f":"User09!$H76","v":1},{"$f":"User10!$H76","v":1},{"$f":"User11!$H76","v":1},{"$f":"User12!$H76","v":1},{"$f":"User13!$H76","v":1},{"$f":"User14!$H76","v":1},{"$f":"User15!$H76","v":1},{"$f":"User16!$H76","v":1},{"$f":"User17!$H76","v":1},{"$f":"User18!$H76","v":1},{"$f":"User19!$H76","v":1},{"$f":"User20!$H76","v":1},{"$f":"User21!$H76","v":1},{"$f":"User22!$H76","v":1},{"$f":"User23!$H76","v":1},{"$f":"User24!$H76","v":1},{"$f":"User25!$H76","v":1},{"$f":"User26!$H76","v":1},{"$f":"User27!$H76","v":1},{"$f":"User28!$H76","v":1},{"$f":"User29!$H76","v":1},{"$f":"User30!$H76","v":1},{"$f":"User31!$H76","v":1},{"$f":"User32!$H76","v":1},{"$f":"User33!$H76","v":1},{"$f":"User34!$H76","v":1},{"$f":"User35!$H76","v":1},{"$f":"User36!$H76","v":1},{"$f":"User37!$H76","v":1},{"$f":"User38!$H76","v":1},{"$f":"User39!$H76","v":1},{"$f":"User40!$H76","v":1},{"$f":"User41!$H76","v":1},{"$f":"User42!$H76","v":1},{"$f":"User43!$H76","v":1},{"$f":"User44!$H76","v":1},{"$f":"User45!$H76","v":1},{"$f":"User46!$H76","v":1},{"$f":"User47!$H76","v":1},{"$f":"User48!$H76","v":1},{"$f":"User49!$H76","v":1},{"$f":"User50!$H76","v":1},null,0,{"$f":"IFERROR(BB15*100/SUM(BB4:BB15), 0)","v":0},{"$f":"IF((BB15>0),RANK(BB15,BB4:BB15,0),\"SIN RANGO\")","v":"SIN RANGO"},null,1,{"$f":"IFERROR(STDEV(IF(C15:AZ15<>1, C15:AZ15, \"\")), 0)","v":0},{"$f":"IFERROR(MEDIAN(IF(C15:AZ15<>1, C15:AZ15, \"\")), 1)","v":1},"SIN RANGO",null,0]
[]
[null,null,null,null,null,null,null,null,null,null,null,null,null,null,null,null,null,null,null,null,null,null,null,null,null,null,null,null,null,null,null,null,null,null,null,null,null,null,null,null,null,null,null,null,null,null,null,null,null,null,null,null,null,null,null,null,null,null,null,null,null,null,{"$f":"SUM(BK4:BK15)","v":0},{"$f":"SUM(BL7:BL12)","v":0},"MENCIONES"]
[null,null,null,null,null,null,null,null,null,null,null,null,null,null,null,null,null,null,null,null,null,null,null,null,null,null,null,null,null,null,null,null,null,null,null,null,null,null,null,null,null,null,null,null,null,null,null,null,null,null,null,null,null,null,null,null,null,null,null,null,null,null,{"$f":"IFERROR(BK17*100/(SUM(BK17:BL17)), 0)","v":0},{"$f":"IFERROR(BL17*100/(SUM(BK17:BL17)), 0)","v":0},"PORCENTAJES"]

{"sheet":"ItemE","index":55,"n_rows":18,"n_cols":65,"rows_kept":18,"cut":false,"hidden":false,"merged":[[1,63,2,63],[1,49,2,49],[1,50,2,50],[1,51,2,51],[1,53,2,53],[1,54,2,54],[1,55,2,55],[1,57,2,57],[1,58,2,58],[1,59,2,59],[1,60,2,60],[1,62,2,62],[1,48,2,48],[1,37,2,37],[1,38,2,38],[1,39,2,39],[1,40,2,40],[1,41,2,41],[1,42,2,42],[1,43,2,43],[1,44,2,44],[1,45,2,45],[1,46,2,46],[1,47,2,47],[1,36,2,36],[1,25,2,25],[1,26,2,26],[1,27,2,27],[1,28,2,28],[1,29,2,29],[1,30,2,30],[1,31,2,31],[1,32,2,32],[1,33,2,33],[1,34,2,34],[1,35,2,35],[1,24,2,24],[1,13,2,13],[1,14,2,14],[1,15,2,15],[1,16,2,16],[1,17,2,17],[1,18,2,18],[1,19,2,19],[1,20,2,20],[1,21,2,21],[1,22,2,22],[1,23,2,23],[1,12,2,12],[1,1,2,1],[1,2,2,2],[1,3,2,3],[1,4,2,4],[1,5,2,5],[1,6,2,6],[1,7,2,7],[1,8,2,8],[1,9,2,9],[1,10,2,10],[1,11,2,11]]}
[]
[null,"EMOCIONES/USUARIOS",1,2,3,4,5,6,7,8,9,10,11,12,13,14,15,16,17,18,19,20,21,22,23,24,25,26,27,28,29,30,31,32,33,34,35,36,37,38,39,40,41,42,43,44,45,46,47,48,49,50,null,"FRECUENCIA","% DE MENCIÓN","JERARQUÍA FRECUENCIA (MEDIA)",null,"MEDIA DE INTENSIDAD","DESVIACION ESTÁNDAR","MEDIANA DE INTENSIDAD","JERARQUÍA INTENSIDAD (MEDIA)",null,"POSITIVAS","NEGATIVAS"]
[]
[null,{"$f":"User01!B13","v":"ALEGRÍA"},{"$f":"User01!$H83","v":1},{"$f":"User02!$H83","v":1},{"$f":"User03!$H83","v":1},{"$f":"User04!$H83","v":1},{"$f":"User05!$H83","v":1},{"$f":"User06!$H83","v":1},{"$f":"User07!$H83","v":1},{"$f":"User08!$H83","v":1},{"$f":"User09!$H83","v":1},{"$f":"User10!$H83","v":1},{"$f":"User11!$H83","v":1},{"$f":"User12!$H83","v":1},{"$f":"User13!$H83","v":1},{"$f":"User14!$H83","v":1},{"$f":"User15!$H83","v":1},{"$f":"User16!$H83","v":1},{"$f":"User17!$H83","v":1},{"$f":"User18!$H83","v":1},{"$f":"User19!$H83","v":1},{"$f":"User20!$H83","v":1},{"$f":"User21!$H83","v":1},{"$f":"User22!$H83","v":1},{"$f":"User23!$H83","v":1},{"$f":"User24!$H83","v":1},{"$f":"User25!$H83","v":1},{"$f":"User26!$H83","v":1},{"$f":"User27!$H83","v":1},{"$f":"User28!$H83","v":1},{"$f":"User29!$H83","v":1},{"$f":"User30!$H83","v":1},{"$f":"User31!$H83","v":1},{"$f":"User32!$H83","v":1},{"$f":"User33!$H83","v":1},{"$f":"User34!$H83","v":1},{"$f":"User35!$H83","v":1},{"$f":"User36!$H83","v":1},{"$f":"User37!$H83","v":1},{"$f":"User38!$H83","v":1},{"$f":"User39!$H83","v":1},{"$f":"User40!$H83","v":1},{"$f":"User41!$H83","v":1},{"$f":"User42!$H83","v":1},{"$f":"User43!$H83","v":1},{"$f":"User44!$H83","v":1},{"$f":"User45!$H83","v":1},{"$f":"User46!$H83","v":1},{"$f":"User47!$H83","v":1},{"$f":"User48!$H83","v":1},{"$f":"User49!$H83","v":1},{"$f":"User50!$H83","v":1},null,{"$f":"COUNTIF(C4:AZ4, \"<>1\")","v":0},{"$f":"IFERROR(BB4*100/SUM(BB4:BB15), 0)","v":0},{"$f":"IF((BB4>0),RANK(BB4,BB4:BB15,0),\"SIN RANGO\")","v":"SIN RANGO"},null,{"$f":"IFERROR(AVERAGEIF(C4:AZ4, \">1\"), 1)","v":1},{"$f":"IFERROR(STDEV(IF(C4:AZ4<>1, C4:AZ4, \"\")), 0)","v":0},{"$f":"IFERROR(MEDIAN(IF(C4:AZ4<>1, C4:AZ4, \"\")), 1)","v":1},{"$f":"IF((BF4>1),RANK(BF4,$BF$4:$BF$15,0),\"SIN RANGO\")","v":"SIN RANGO"},null,{"$f":"BB4","v":0}]
[null,{"$f":"User01!B14","v":"SATISFACCIÓN"},{"$f":"User01!$H84","v":1},{"$f":"User02!$H84","v":1},{"$f":"User03!$H84","v":1},{"$f":"User04!$H84","v":1},{"$f":"User05!$H84","v":1},{"$f":"User06!$H84","v":1},{"$f":"User07!$H84","v":1},{"$f":"User08!$H84","v":1},{"$f":"User09!$H84","v":1},{"$f":"User10!$H84","v":1},{"$f":"User11!$H84","v":1},{"$f":"User12!$H84","v":1},{"$f":"User13!$H84","v":1},{"$f":"User14!$H84","v":1},{"$f":"User15!$H84","v":1},{"$f":"User16!$H84","v":1},{"$f":"User17!$H84","v":1},{"$f":"User18!$H84","v":1},{"$f":"User19!$H84","v":1},{"$f":"User20!$H84","v":1},{"$f":"User21!$H84","v":1},{"$f":"User22!$H84","v":1},{"$f":"User23!$H84","v":1},{"$f":"User24!$H84","v":1},{"$f":"User25!$H84","v":1},{"$f":"User26!$H84","v":1},{"$f":"User27!$H84","v":1},{"$f":"User28!$H84","v":1},{"$f":"User29!$H84","v":1},{"$f":"User30!$H84","v":1},{"$f":"User31!$H84","v":1},{"$f":"User32!$H84","v":1},{"$f":"User33!$H84","v":1},{"$f":"User34!$H84","v":1},{"$f":"User35!$H84","v":1},{"$f":"User36!$H84","v":1},{"$f":"User37!$H84","v":1},{"$f":"User38!$H84","v":1},{"$f":"User39!$H84","v":1},{"$f":"User40!$H84","v":1},{"$f":"User41!$H84","v":1},{"$f":"User42!$H84","v":1},{"$f":"User43!$H84","v":1},{"$f":"User44!$H84","v":1},{"$f":"User45!$H84","v":1},{"$f":"User46!$H84","v":1},{"$f":"User47!$H84","v":1},{"$f":"User48!$H84","v":1},{"$f":"User49!$H84","v":1},{"$f":"User50!$H84","v":1},null,{"$f":"COUNTIF(C5:AZ5, \"<>1\")","v":0},{"$f":"IFERROR(BB5*100/SUM(BB4:BB15), 0)","v":0},{"$f":"IF((BB5>0),RANK(BB5,BB4:BB15,0),\"SIN RANGO\")","v":"SIN RANGO"},null,{"$f":"IFERROR(AVERAGEIF(C5:AZ5, \">1\"), 1)","v":1},{"$f":"IFERROR(STDEV(IF(C5:AZ5<>1, C5:AZ5, \"\")), 0)","v":0},{"$f":"IFERROR(MEDIAN(IF(C5:AZ5<>1, C5:AZ5, \"\")), 1)","v":1},{"$f":"IF((BF5>1),RANK(BF5,$BF$4:$BF$15,0),\"SIN RANGO\")","v":"SIN RANGO"},null,{"$f":"BB5","v":0}]
[null,{"$f":"User01!B15","v":"FASCINACIÓN"},{"$f":"User01!$H85","v":1},{"$f":"User02!$H85","v":1},{"$f":"User03!$H85","v":1},{"$f":"User04!$H85","v":1},{"$f":"User05!$H85","v":1},{"$f":"User06!$H85","v":1},{"$f":"User07!$H85","v":1},{"$f":"User08!$H85","v":1},{"$f":"User09!$H85","v":1},{"$f":"User10!$H85","v":1},{"$f":"User11!$H85","v":1},{"$f":"User12!$H85","v":1},{"$f":"User13!$H85","v":1},{"$f":"User14!$H85","v":1},{"$f":"User15!$H85","v":1},{"$f":"User16!$H85","v":1},{"$f":"User17!$H85","v":1},{"$f":"User18!$H85","v":1},{"$f":"User19!$H85","v":1},{"$f":"User20!$H85","v":1},{"$f":"User21!$H85","v":1},{"$f":"User22!$H85","v":1},{"$f":"User23!$H85","v":1},{"$f":"User24!$H85","v":1},{"$f":"User25!$H85","v":1},{"$f":"User26!$H85","v":1},{"$f":"User27!$H85","v":1},{"$f":"User28!$H85","v":1},{"$f":"User29!$H85","v":1},{"$f":"User30!$H85","v":1},{"$f":"User31!$H85","v":1},{"$f":"User32!$H85","v":1},{"$f":"User33!$H85","v":1},{"$f":"User34!$H85","v":1},{"$f":"User35!$H85","v":1},{"$f":"User36!$H85","v":1},{"$f":"User37!$H85","v":1},{"$f":"User38!$H85","v":1},{"$f":"User39!$H85","v":1},{"$f":"User40!$H85","v":1},{"$f":"User41!$H85","v":1},{"$f":"User42!$H85","v":1},{"$f":"User43!$H85","v":1},{"$f":"User44!$H85","v":1},{"$f":"User45!$H85","v":1},{"$f":"User46!$H85","v":1},{"$f":"User47!$H85","v":1},{"$f":"User48!$H85","v":1},{"$f":"User49!$H85","v":1},{"$f":"User50!$H85","v":1},null,0,{"$f":"IFERROR(BB6*100/SUM(BB4:BB15), 0)","v":0},{"$f":"IF((BB6>0),RANK(BB6,BB4:BB15,0),\"SIN RANGO\")","v":"SIN RANGO"},null,1,{"$f":"IFERROR(STDEV(IF(C6:AZ6<>1, C6:AZ6, \"\")), 0)","v":0},{"$f":"IFERROR(MEDIAN(IF(C6:AZ6<>1, C6:AZ6, \"\")), 1)","v":1},"SIN RANGO",null,0]
[null,{"$f":"User01!B16","v":"ABURRIMIENTO"},{"$f":"User01!$H86","v":1},{"$f":"User02!$H86","v":1},{"$f":"User03!$H86","v":1},{"$f":"User04!$H86","v":1},{"$f":"User05!$H86","v":1},{"$f":"User06!$H86","v":1},{"$f":"User07!$H86","v":1},{"$f":"User08!$H86","v":1},{"$f":"User09!$H86","v":1},{"$f":"User10!$H86","v":1},{"$f":"User11!$H86","v":1},{"$f":"User12!$H86","v":1},{"$f":"User13!$H86","v":1},{"$f":"User14!$H86","v":1},{"$f":"User15!$H86","v":1},{"$f":"User16!$H86","v":1},{"$f":"User17!$H86","v":1},{"$f":"User18!$H86","v":1},{"$f":"User19!$H86","v":1},{"$f":"User20!$H86","v":1},{"$f":"User21!$H86","v":1},{"$f":"User22!$H86","v":1},{"$f":"User23!$H86","v":1},{"$f":"User24!$H86","v":1},{"$f":"User25!$H86","v":1},{"$f":"User26!$H86","v":1},{"$f":"User27!$H86","v":1},{"$f":"User28!$H86","v":1},{"$f":"User29!$H86","v":1},{"$f":"User30!$H86","v":1},{"$f":"User31!$H86","v":1},{"$f":"User32!$H86","v":1},{"$f":"User33!$H86","v":1},{"$f":"User34!$H86","v":1},{"$f":"User35!$H86","v":1},{"$f":"User36!$H86","v":1},{"$f":"User37!$H86","v":1},{"$f":"User38!$H86","v":1},{"$f":"User39!$H86","v":1},{"$f":"User40!$H86","v":1},{"$f":"User41!$H86","v":1},{"$f":"User42!$H86","v":1},{"$f":"User43!$H86","v":1},{"$f":"User44!$H86","v":1},{"$f":"User45!$H86","v":1},{"$f":"User46!$H86","v":1},{"$f":"User47!$H86","v":1},{"$f":"User48!$H86","v":1},{"$f":"User49!$H86","v":1},{"$f":"User50!$H86","v":1},null,0,{"$f":"IFERROR(BB7*100/SUM(BB4:BB15), 0)","v":0},{"$f":"IF((BB7>0),RANK(BB7,BB4:BB15,0),\"SIN RANGO\")","v":"SIN RANGO"},null,1,{"$f":"IFERROR(STDEV(IF(C7:AZ7<>1, C7:AZ7, \"\")), 0)","v":0},{"$f":"IFERROR(MEDIAN(IF(C7:AZ7<>1, C7:AZ7, \"\")), 1)","v":1},"SIN RANGO",null,null,{"$f":"BB7:BB12","v":0}]
[null,{"$f":"User01!B17","v":"ENFADO"},{"$f":"User01!$H87","v":1},{"$f":"User02!$H87","v":1},{"$f":"User03!$H87","v":1},{"$f":"User04!$H87","v":1},{"$f":"User05!$H87","v":1},{"$f":"User06!$H87","v":1},{"$f":"User07!$H87","v":1},{"$f":"User08!$H87","v":1},{"$f":"User09!$H87","v":1},{"$f":"User10!$H87","v":1},{"$f":"User11!$H87","v":1},{"$f":"User12!$H87","v":1},{"$f":"User13!$H87","v":1},{"$f":"User14!$H87","v":1},{"$f":"User15!$H87","v":1},{"$f":"User16!$H87","v":1},{"$f":"User17!$H87","v":1},{"$f":"User18!$H87","v":1},{"$f":"User19!$H87","v":1},{"$f":"User20!$H87","v":1},{"$f":"User21!$H87","v":1},{"$f":"User22!$H87","v":1},{"$f":"User23!$H87","v":1},{"$f":"User24!$H87","v":1},{"$f":"User25!$H87","v":1},{"$f":"User26!$H87","v":1},{"$f":"User27!$H87","v":1},{"$f":"User28!$H87","v":1},{"$f":"User29!$H87","v":1},{"$f":"User30!$H87","v":1},{"$f":"User31!$H87","v":1},{"$f":"User32!$H87","v":1},{"$f":"User33!$H87","v":1},{"$f":"User34!$H87","v":1},{"$f":"User35!$H87","v":1},{"$f":"User36!$H87","v":1},{"$f":"User37!$H87","v":1},{"$f":"User38!$H87","v":1},{"$f":"User39!$H87","v":1},{"$f":"User40!$H87","v":1},{"$f":"User41!$H87","v":1},{"$f":"User42!$H87","v":1},{"$f":"User43!$H87","v":1},{"$f":"User44!$H87","v":1},{"$f":"User45!$H87","v":1},{"$f":"User46!$H87","v":1},{"$f":"User47!$H87","v":1},{"$f":"User48!$H87","v":1},{"$f":"User49!$H87","v":1},{"$f":"User50!$H87","v":1},null,0,{"$f":"IFERROR(BB8*100/SUM(BB4:BB15), 0)","v":0},{"$f":"IF((BB8>0),RANK(BB8,BB4:BB15,0),\"SIN RANGO\")","v":"SIN RANGO"},null,1,{"$f":"IFERROR(STDEV(IF(C8:AZ8<>1, C8:AZ8, \"\")), 0)","v":0},{"$f":"IFERROR(MEDIAN(IF(C8:AZ8<>1, C8:AZ8, \"\")), 1)","v":1},"SIN RANGO",null,null,{"$f":"BB8:BB13","v":0}]
[null,{"$f":"User01!B18","v":"TRISTEZA"},{"$f":"User01!$H88","v":1},{"$f":"User02!$H88","v":1},{"$f":"User03!$H88","v":1},{"$f":"User04!$H88","v":1},{"$f":"User05!$H88","v":1},{"$f":"User06!$H88","v":1},{"$f":"User07!$H88","v":1},{"$f":"User08!$H88","v":1},{"$f":"User09!$H88","v":1},{"$f":"User10!$H88","v":1},{"$f":"User11!$H88","v":1},{"$f":"User12!$H88","v":1},{"$f":"User13!$H88","v":1},{"$f":"User14!$H88","v":1},{"$f":"User15!$H88","v":1},{"$f":"User16!$H88","v":1},{"$f":"User17!$H88","v":1},{"$f":"User18!$H88","v":1},{"$f":"User19!$H88","v":1},{"$f":"User20!$H88","v":1},{"$f":"User21!$H88","v":1},{"$f":"User22!$H88","v":1},{"$f":"User23!$H88","v":1},{"$f":"User24!$H88","v":1},{"$f":"User25!$H88","v":1},{"$f":"User26!$H88","v":1},{"$f":"User27!$H88","v":1},{"$f":"User28!$H88","v":1},{"$f":"User29!$H88","v":1},{"$f":"User30!$H88","v":1},{"$f":"User31!$H88","v":1},{"$f":"User32!$H88","v":1},{"$f":"User33!$H88","v":1},{"$f":"User34!$H88","v":1},{"$f":"User35!$H88","v":1},{"$f":"User36!$H88","v":1},{"$f":"User37!$H88","v":1},{"$f":"User38!$H88","v":1},{"$f":"User39!$H88","v":1},{"$f":"User40!$H88","v":1},{"$f":"User41!$H88","v":1},{"$f":"User42!$H88","v":1},{"$f":"User43!$H88","v":1},{"$f":"User44!$H88","v":1},{"$f":"User45!$H88","v":1},{"$f":"User46!$H88","v":1},{"$f":"User47!$H88","v":1},{"$f":"User48!$H88","v":1},{"$f":"User49!$H88","v":1},{"$f":"User50!$H88","v":1},null,0,{"$f":"IFERROR(BB9*100/SUM(BB4:BB15), 0)","v":0},{"$f":"IF((BB9>0),RANK(BB9,BB4:BB15,0),\"SIN RANGO\")","v":"SIN RANGO"},null,1,{"$f":"IFERROR(STDEV(IF(C9:AZ9<>1, C9:AZ9, \"\")), 0)","v":0},{"$f":"IFERROR(MEDIAN(IF(C9:AZ9<>1, C9:AZ9, \"\")), 1)","v":1},"SIN RANGO",null,null,0]
[null,{"$f":"User01!B19","v":"VERGÜENZA"},{"$f":"User01!$H89","v":1},{"$f":"User02!$H89","v":1},{"$f":"User03!$H89","v":1},{"$f":"User04!$H89","v":1},{"$f":"User05!$H89","v":1},{"$f":"User06!$H89","v":1},{"$f":"User07!$H89","v":1},{"$f":"User08!$H89","v":1},{"$f":"User09!$H89","v":1},{"$f":"User10!$H89","v":1},{"$f":"User11!$H89","v":1},{"$f":"User12!$H89","v":1},{"$f":"User13!$H89","v":1},{"$f":"User14!$H89","v":1},{"$f":"User15!$H89","v":1},{"$f":"User16!$H89","v":1},{"$f":"User17!$H89","v":1},{"$f":"User18!$H89","v":1},{"$f":"User19!$H89","v":1},{"$f":"User20!$H89","v":1},{"$f":"User21!$H89","v":1},{"$f":"User22!$H89","v":1},{"$f":"User23!$H89","v":1},{"$f":"User24!$H89","v":1},{"$f":"User25!$H89","v":1},{"$f":"User26!$H89","v":1},{"$f":"User27!$H89","v":1},{"$f":"User28!$H89","v":1},{"$f":"User29!$H89","v":1},{"$f":"User30!$H89","v":1},{"$f":"User31!$H89","v":1},{"$f":"User32!$H89","v":1},{"$f":"User33!$H89","v":1},{"$f":"User34!$H89","v":1},{"$f":"User35!$H89","v":1},{"$f":"User36!$H89","v":1},{"$f":"User37!$H89","v":1},{"$f":"User38!$H89","v":1},{"$f":"User39!$H89","v":1},{"$f":"User40!$H89","v":1},{"$f":"User41!$H89","v":1},{"$f":"User42!$H89","v":1},{"$f":"User43!$H89","v":1},{"$f":"User44!$H89","v":1},{"$f":"User45!$H89","v":1},{"$f":"User46!$H89","v":1},{"$f":"User47!$H89","v":1},{"$f":"User48!$H89","v":1},{"$f":"User49!$H89","v":1},{"$f":"User50!$H89","v":1},null,0,{"$f":"IFERROR(BB10*100/SUM(BB4:BB15), 0)","v":0},{"$f":"IF((BB10>0),RANK(BB10,BB4:BB15,0),\"SIN RANGO\")","v":"SIN RANGO"},null,1,{"$f":"IFERROR(STDEV(IF(C10:AZ10<>1, C10:AZ10, \"\")), 0)","v":0},{"$f":"IFERROR(MEDIAN(IF(C10:AZ10<>1, C10:AZ10, \"\")), 1)","v":1},"SIN RANGO",null,null,{"$f":"BB10:BB15","v":0}]
[null,{"$f":"User01!B20","v":"MIEDO"},{"$f":"User01!$H90","v":1},{"$f":"User02!$H90","v":1},{"$f":"User03!$H90","v":1},{"$f":"User04!$H90","v":1},{"$f":"User05!$H90","v":1},{"$f":"User06!$H90","v":1},{"$f":"User07!$H90","v":1},{"$f":"User08!$H90","v":1},{"$f":"User09!$H90","v":1},{"$f":"User10!$H90","v":1},{"$f":"User11!$H90","v":1},{"$f":"User12!$H90","v":1},{"$f":"User13!$H90","v":1},{"$f":"User14!$H90","v":1},{"$f":"User15!$H90","v":1},{"$f":"User16!$H90","v":1},{"$f":"User17!$H90","v":1},{"$f":"User18!$H90","v":1},{"$f":"User19!$H90","v":1},{"$f":"User20!$H90","v":1},{"$f":"User21!$H90","v":1},{"$f":"User22!$H90","v":1},{"$f":"User23!$H90","v":1},{"$f":"User24!$H90","v":1},{"$f":"User25!$H90","v":1},{"$f":"User26!$H90","v":1},{"$f":"User27!$H90","v":1},{"$f":"User28!$H90","v":1},{"$f":"User29!$H90","v":1},{"$f":"User30!$H90","v":1},{"$f":"User31!$H90","v":1},{"$f":"User32!$H90","v":1},{"$f":"User33!$H90","v":1},{"$f":"User34!$H90","v":1},{"$f":"User35!$H90","v":1},{"$f":"User36!$H90","v":1},{"$f":"User37!$H90","v":1},{"$f":"User38!$H90","v":1},{"$f":"User39!$H90","v":1},{"$f":"User40!$H90","v":1},{"$f":"User41!$H90","v":1},{"$f":"User42!$H90","v":1},{"$f":"User43!$H90","v":1},{"$f":"User44!$H90","v":1},{"$f":"User45!$H90","v":1},{"$f":"User46!$H90","v":1},{"$f":"User47!$H90","v":1},{"$f":"User48!$H90","v":1},{"$f":"User49!$H90","v":1},{"$f":"User50!$H90","v":1},null,0,{"$f":"IFERROR(BB11*100/SUM(BB4:BB15), 0)","v":0},{"$f":"IF((BB11>0),RANK(BB11,BB4:BB15,0),\"SIN RANGO\")","v":"SIN RANGO"},null,1,{"$f":"IFERROR(STDEV(IF(C11:AZ11<>1, C11:AZ11, \"\")), 0)","v":0},{"$f":"IFERROR(MEDIAN(IF(C11:AZ11<>1, C11:AZ11, \"\")), 1)","v":1},"SIN RANGO",null,null,{"$f":"BB11:BB17","v":0}]
[null,{"$f":"User01!B21","v":"REPUGNANCIA"},{"$f":"User01!$H91","v":1},{"$f":"User02!$H91","v":1},{"$f":"User03!$H91","v":1},{"$f":"User04!$H91","v":1},{"$f":"User05!$H91","v":1},{"$f":"User06!$H91","v":1},{"$f":"User07!$H91","v":1},{"$f":"User08!$H91","v":1},{"$f":"User09!$H91","v":1},{"$f":"User10!$H91","v":1},{"$f":"User11!$H91","v":1},{"$f":"User12!$H91","v":1},{"$f":"User13!$H91","v":1},{"$f":"User14!$H91","v":1},{"$f":"User15!$H91","v":1},{"$f":"User16!$H91","v":1},{"$f":"User17!$H91","v":1},{"$f":"User18!$H91","v":1},{"$f":"User19!$H91","v":1},{"$f":"User20!$H91","v":1},{"$f":"User21!$H91","v":1},{"$f":"User22!$H91","v":1},{"$f":"User23!$H91","v":1},{"$f":"User24!$H91","v":1},{"$f":"User25!$H91","v":1},{"$f":"User26!$H91","v":1},{"$f":"User27!$H91","v":1},{"$f":"User28!$H91","v":1},{"$f":"User29!$H91","v":1},{"$f":"User30!$H91","v":1},{"$f":"User31!$H91","v":1},{"$f":"User32!$H91","v":1},{"$f":"User33!$H91","v":1},{"$f":"User34!$H91","v":1},{"$f":"User35!$H91","v":1},{"$f":"User36!$H91","v":1},{"$f":"User37!$H91","v":1},{"$f":"User38!$H91","v":1},{"$f":"User39!$H91","v":1},{"$f":"User40!$H91","v":1},{"$f":"User41!$H91","v":1},{"$f":"User42!$H91","v":1},{"$f":"User43!$H91","v":1},{"$f":"User44!$H91","v":1},{"$f":"User45!$H91","v":1},{"$f":"User46!$H91","v":1},{"$f":"User47!$H91","v":1},{"$f":"User48!$H91","v":1},{"$f":"User49!$H91","v":1},{"$f":"User50!$H91","v":1},null,0,{"$f":"IFERROR(BB12*100/SUM(BB4:BB15), 0)","v":0},{"$f":"IF((BB12>0),RANK(BB12,BB4:BB15,0),\"SIN RANGO\")","v":"SIN RANGO"},null,1,{"$f":"IFERROR(STDEV(IF(C12:AZ12<>1, C12:AZ12, \"\")), 0)","v":0},{"$f":"IFERROR(MEDIAN(IF(C12:AZ12<>1, C12:AZ12, \"\")), 1)","v":1},"SIN RANGO",null,null,{"$f":"BB12:BB18","v":0}]
[null,{"$f":"User01!B22","v":"DESEO"},{"$f":"User01!$H92","v":1},{"$f":"User02!$H92","v":1},{"$f":"User03!$H92","v":1},{"$f":"User04!$H92","v":1},{"$f":"User05!$H92","v":1},{"$f":"User06!$H92","v":1},{"$f":"User07!$H92","v":1},{"$f":"User08!$H92","v":1},{"$f":"User09!$H92","v":1},{"$f":"User10!$H92","v":1},{"$f":"User11!$H92","v":1},{"$f":"User12!$H92","v":1},{"$f":"User13!$H92","v":1},{"$f":"User14!$H92","v":1},{"$f":"User15!$H92","v":1},{"$f":"User16!$H92","v":1},{"$f":"User17!$H92","v":1},{"$f":"User18!$H92","v":1},{"$f":"User19!$H92","v":1},{"$f":"User20!$H92","v":1},{"$f":"User21!$H92","v":1},{"$f":"User22!$H92","v":1},{"$f":"User23!$H92","v":1},{"$f":"User24!$H92","v":1},{"$f":"User25!$H92","v":1},{"$f":"User26!$H92","v":1},{"$f":"User27!$H92","v":1},{"$f":"User28!$H92","v":1},{"$f":"User29!$H92","v":1},{"$f":"User30!$H92","v":1},{"$f":"User31!$H92","v":1},{"$f":"User32!$H92","v":1},{"$f":"User33!$H92","v":1},{"$f":"User34!$H92","v":1},{"$f":"User35!$H92","v":1},{"$f":"User36!$H92","v":1},{"$f":"User37!$H92","v":1},{"$f":"User38!$H92","v":1},{"$f":"User39!$H92","v":1},{"$f":"User40!$H92","v":1},{"$f":"User41!$H92","v":1},{"$f":"User42!$H92","v":1},{"$f":"User43!$H92","v":1},{"$f":"User44!$H92","v":1},{"$f":"User45!$H92","v":1},{"$f":"User46!$H92","v":1},{"$f":"User47!$H92","v":1},{"$f":"User48!$H92","v":1},{"$f":"User49!$H92","v":1},{"$f":"User50!$H92","v":1},null,0,{"$f":"IFERROR(BB13*100/SUM(BB4:BB15), 0)","v":0},{"$f":"IF((BB13>0),RANK(BB13,BB4:BB15,0),\"SIN RANGO\")","v":"SIN RANGO"},null,1,{"$f":"IFERROR(STDEV(IF(C13:AZ13<>1, C13:AZ13, \"\")), 0)","v":0},{"$f":"IFERROR(MEDIAN(IF(C13:AZ13<>1, C13:AZ13, \"\")), 1)","v":1},"SIN RANGO",null,{"$f":"BB13","v":0}]
[null,{"$f":"User01!B23","v":"ESPERANZA"},{"$f":"User01!$H93","v":1},{"$f":"User02!$H93","v":1},{"$f":"User03!$H93","v":1},{"$f":"User04!$H93","v":1},{"$f":"User05!$H93","v":1},{"$f":"User06!$H93","v":1},{"$f":"User07!$H93","v":1},{"$f":"User08!$H93","v":1},{"$f":"User09!$H93","v":1},{"$f":"User10!$H93","v":1},{"$f":"User11!$H93","v":1},{"$f":"User12!$H93","v":1},{"$f":"User13!$H93","v":1},{"$f":"User14!$H93","v":1},{"$f":"User15!$H93","v":1},{"$f":"User16!$H93","v":1},{"$f":"User17!$H93","v":1},{"$f":"User18!$H93","v":1},{"$f":"User19!$H93","v":1},{"$f":"User20!$H93","v":1},{"$f":"User21!$H93","v":1},{"$f":"User22!$H93","v":1},{"$f":"User23!$H93","v":1},{"$f":"User24!$H93","v":1},{"$f":"User25!$H93","v":1},{"$f":"User26!$H93","v":1},{"$f":"User27!$H93","v":1},{"$f":"User28!$H93","v":1},{"$f":"User29!$H93","v":1},{"$f":"User30!$H93","v":1},{"$f":"User31!$H93","v":1},{"$f":"User32!$H93","v":1},{"$f":"User33!$H93","v":1},{"$f":"User34!$H93","v":1},{"$f":"User35!$H93","v":1},{"$f":"User36!$H93","v":1},{"$f":"User37!$H93","v":1},{"$f":"User38!$H93","v":1},{"$f":"User39!$H93","v":1},{"$f":"User40!$H93","v":1},{"$f":"User41!$H93","v":1},{"$f":"User42!$H93","v":1},{"$f":"User43!$H93","v":1},{"$f":"User44!$H93","v":1},{"$f":"User45!$H93","v":1},{"$f":"User46!$H93","v":1},{"$f":"User47!$H93","v":1},{"$f":"User48!$H93","v":1},{"$f":"User49!$H93","v":1},{"$f":"User50!$H93","v":1},null,0,{"$f":"IFERROR(BB14*100/SUM(BB4:BB15), 0)","v":0},{"$f":"IF((BB14>0),RANK(BB14,BB4:BB15,0),\"SIN RANGO\")","v":"SIN RANGO"},null,1,{"$f":"IFERROR(STDEV(IF(C14:AZ14<>1, C14:AZ14, \"\")), 0)","v":0},{"$f":"IFERROR(MEDIAN(IF(C14:AZ14<>1, C14:AZ14, \"\")), 1)","v":1},"SIN RANGO",null,{"$f":"BB14","v":0}]
[null,{"$f":"User01!B24","v":"ORGULLO"},{"$f":"User01!$H94","v":1},{"$f":"User02!$H94","v":1},{"$f":"User03!$H94","v":1},{"$f":"User04!$H94","v":1},{"$f":"User05!$H94","v":1},{"$f":"User06!$H94","v":1},{"$f":"User07!$H94","v":1},{"$f":"User08!$H94","v":1},{"$f":"User09!$H94","v":1},{"$f":"User10!$H94","v":1},{"$f":"User11!$H94","v":1},{"$f":"User12!$H94","v":1},{"$f":"User13!$H94","v":1},{"$f":"User14!$H94","v":1},{"$f":"User15!$H94","v":1},{"$f":"User16!$H94","v":1},{"$f":"User17!$H94","v":1},{"$f":"User18!$H94","v":1},{"$f":"User19!$H94","v":1},{"$f":"User20!$H94","v":1},{"$f":"User21!$H94","v":1},{"$f":"User22!$H94","v":1},{"$f":"User23!$H94","v":1},{"$f":"User24!$H94","v":1},{"$f":"User25!$H94","v":1},{"$f":"User26!$H94","v":1},{"$f":"User27!$H94","v":1},{"$f":"User28!$H94","v":1},{"$f":"User29!$H94","v":1},{"$f":"User30!$H94","v":1},{"$f":"User31!$H94","v":1},{"$f":"User32!$H94","v":1},{"$f":"User33!$H94","v":1},{"$f":"User34!$H94","v":1},{"$f":"User35!$H94","v":1},{"$f":"User36!$H94","v":1},{"$f":"User37!$H94","v":1},{"$f":"User38!$H94","v":1},{"$f":"User39!$H94","v":1},{"$f":"User40!$H94","v":1},{"$f":"User41!$H94","v":1},{"$f":"User42!$H94","v":1},{"$f":"User43!$H94","v":1},{"$f":"User44!$H94","v":1},{"$f":"User45!$H94","v":1},{"$f":"User46!$H94","v":1},{"$f":"User47!$H94","v":1},{"$f":"User48!$H94","v":1},{"$f":"User49!$H94","v":1},{"$f":"User50!$H94","v":1},null,0,{"$f":"IFERROR(BB15*100/SUM(BB4:BB15), 0)","v":0},{"$f":"IF((BB15>0),RANK(BB15,BB4:BB15,0),\"SIN RANGO\")","v":"SIN RANGO"},null,1,{"$f":"IFERROR(STDEV(IF(C15:AZ15<>1, C15:AZ15, \"\")), 0)","v":0},{"$f":"IFERROR(MEDIAN(IF(C15:AZ15<>1, C15:AZ15, \"\")), 1)","v":1},"SIN RANGO",null,0]
[]
[null,null,null,null,null,null,null,null,null,null,null,null,null,null,null,null,null,null,null,null,null,null,null,null,null,null,null,null,null,null,null,null,null,null,null,null,null,null,null,null,null,null,null,null,null,null,null,null,null,null,null,null,null,null,null,null,null,null,null,null,null,null,{"$f":"SUM(BK4:BK15)","v":0},{"$f":"SUM(BL7:BL12)","v":0},"MENCIONES"]
[null,null,null,null,null,null,null,null,null,null,null,null,null,null,null,null,null,null,null,null,null,null,null,null,null,null,null,null,null,null,null,null,null,null,null,null,null,null,null,null,null,null,null,null,null,null,null,null,null,null,null,null,null,null,null,null,null,null,null,null,null,null,{"$f":"IFERROR(BK17*100/(SUM(BK17:BL17)), 0)","v":0},{"$f":"IFERROR(BL17*100/(SUM(BK17:BL17)), 0)","v":0},"PORCENTAJES"]

{"sheet":"ItemF","index":56,"n_rows":18,"n_cols":65,"rows_kept":18,"cut":false,"hidden":false,"merged":[[1,63,2,63],[1,49,2,49],[1,50,2,50],[1,51,2,51],[1,53,2,53],[1,54,2,54],[1,55,2,55],[1,57,2,57],[1,58,2,58],[1,59,2,59],[1,60,2,60],[1,62,2,62],[1,48,2,48],[1,37,2,37],[1,38,2,38],[1,39,2,39],[1,40,2,40],[1,41,2,41],[1,42,2,42],[1,43,2,43],[1,44,2,44],[1,45,2,45],[1,46,2,46],[1,47,2,47],[1,36,2,36],[1,25,2,25],[1,26,2,26],[1,27,2,27],[1,28,2,28],[1,29,2,29],[1,30,2,30],[1,31,2,31],[1,32,2,32],[1,33,2,33],[1,34,2,34],[1,35,2,35],[1,24,2,24],[1,13,2,13],[1,14,2,14],[1,15,2,15],[1,16,2,16],[1,17,2,17],[1,18,2,18],[1,19,2,19],[1,20,2,20],[1,21,2,21],[1,22,2,22],[1,23,2,23],[1,12,2,12],[1,1,2,1],[1,2,2,2],[1,3,2,3],[1,4,2,4],[1,5,2,5],[1,6,2,6],[1,7,2,7],[1,8,2,8],[1,9,2,9],[1,10,2,10],[1,11,2,11]]}
[]
[null,"EMOCIONES/USUARIOS",1,2,3,4,5,6,7,8,9,10,11,12,13,14,15,16,17,18,19,20,21,22,23,24,25,26,27,28,29,30,31,32,33,34,35,36,37,38,39,40,41,42,43,44,45,46,47,48,49,50,null,"FRECUENCIA","% DE MENCIÓN","JERARQUÍA FRECUENCIA (MEDIA)",null,"MEDIA DE INTENSIDAD","DESVIACION ESTÁNDAR","MEDIANA DE INTENSIDAD","JERARQUÍA INTENSIDAD (MEDIA)",null,"POSITIVAS","NEGATIVAS"]
[]
[null,{"$f":"User01!B13","v":"ALEGRÍA"},{"$f":"User01!$H101","v":1},{"$f":"User02!$H101","v":1},{"$f":"User03!$H101","v":1},{"$f":"User04!$H101","v":1},{"$f":"User05!$H101","v":1},{"$f":"User06!$H101","v":1},{"$f":"User07!$H101","v":1},{"$f":"User08!$H101","v":1},{"$f":"User09!$H101","v":1},{"$f":"User10!$H101","v":1},{"$f":"User11!$H101","v":1},{"$f":"User12!$H101","v":1},{"$f":"User13!$H101","v":1},{"$f":"User14!$H101","v":1},{"$f":"User15!$H101","v":1},{"$f":"User16!$H101","v":1},{"$f":"User17!$H101","v":1},{"$f":"User18!$H101","v":1},{"$f":"User19!$H101","v":1},{"$f":"User20!$H101","v":1},{"$f":"User21!$H101","v":1},{"$f":"User22!$H101","v":1},{"$f":"User23!$H101","v":1},{"$f":"User24!$H101","v":1},{"$f":"User25!$H101","v":1},{"$f":"User26!$H101","v":1},{"$f":"User27!$H101","v":1},{"$f":"User28!$H101","v":1},{"$f":"User29!$H101","v":1},{"$f":"User30!$H101","v":1},{"$f":"User31!$H101","v":1},{"$f":"User32!$H101","v":1},{"$f":"User33!$H101","v":1},{"$f":"User34!$H101","v":1},{"$f":"User35!$H101","v":1},{"$f":"User36!$H101","v":1},{"$f":"User37!$H101","v":1},{"$f":"User38!$H101","v":1},{"$f":"User39!$H101","v":1},{"$f":"User40!$H101","v":1},{"$f":"User41!$H101","v":1},{"$f":"User42!$H101","v":1},{"$f":"User43!$H101","v":1},{"$f":"User44!$H101","v":1},{"$f":"User45!$H101","v":1},{"$f":"User46!$H101","v":1},{"$f":"User47!$H101","v":1},{"$f":"User48!$H101","v":1},{"$f":"User49!$H101","v":1},{"$f":"User50!$H101","v":1},null,{"$f":"COUNTIF(C4:AZ4, \"<>1\")","v":0},{"$f":"IFERROR(BB4*100/SUM(BB4:BB15), 0)","v":0},{"$f":"IF((BB4>0),RANK(BB4,BB4:BB15,0),\"SIN RANGO\")","v":"SIN RANGO"},null,{"$f":"IFERROR(AVERAGEIF(C4:AZ4, \">1\"), 1)","v":1},{"$f":"IFERROR(STDEV(IF(C4:AZ4<>1, C4:AZ4, \"\")), 0)","v":0},{"$f":"IFERROR(MEDIAN(IF(C4:AZ4<>1, C4:AZ4, \"\")), 1)","v":1},{"$f":"IF((BF4>1),RANK(BF4,$BF$4:$BF$15,0),\"SIN RANGO\")","v":"SIN RANGO"},null,{"$f":"BB4","v":0}]
[null,{"$f":"User01!B14","v":"SATISFACCIÓN"},{"$f":"User01!$H102","v":1},{"$f":"User02!$H102","v":1},{"$f":"User03!$H102","v":1},{"$f":"User04!$H102","v":1},{"$f":"User05!$H102","v":1},{"$f":"User06!$H102","v":1},{"$f":"User07!$H102","v":1},{"$f":"User08!$H102","v":1},{"$f":"User09!$H102","v":1},{"$f":"User10!$H102","v":1},{"$f":"User11!$H102","v":1},{"$f":"User12!$H102","v":1},{"$f":"User13!$H102","v":1},{"$f":"User14!$H102","v":1},{"$f":"User15!$H102","v":1},{"$f":"User16!$H102","v":1},{"$f":"User17!$H102","v":1},{"$f":"User18!$H102","v":1},{"$f":"User19!$H102","v":1},{"$f":"User20!$H102","v":1},{"$f":"User21!$H102","v":1},{"$f":"User22!$H102","v":1},{"$f":"User23!$H102","v":1},{"$f":"User24!$H102","v":1},{"$f":"User25!$H102","v":1},{"$f":"User26!$H102","v":1},{"$f":"User27!$H102","v":1},{"$f":"User28!$H102","v":1},{"$f":"User29!$H102","v":1},{"$f":"User30!$H102","v":1},{"$f":"User31!$H102","v":1},{"$f":"User32!$H102","v":1},{"$f":"User33!$H102","v":1},{"$f":"User34!$H102","v":1},{"$f":"User35!$H102","v":1},{"$f":"User36!$H102","v":1},{"$f":"User37!$H102","v":1},{"$f":"User38!$H102","v":1},{"$f":"User39!$H102","v":1},{"$f":"User40!$H102","v":1},{"$f":"User41!$H102","v":1},{"$f":"User42!$H102","v":1},{"$f":"User43!$H102","v":1},{"$f":"User44!$H102","v":1},{"$f":"User45!$H102","v":1},{"$f":"User46!$H102","v":1},{"$f":"User47!$H102","v":1},{"$f":"User48!$H102","v":1},{"$f":"User49!$H102","v":1},{"$f":"User50!$H102","v":1},null,{"$f":"COUNTIF(C5:AZ5, \"<>1\")","v":0},{"$f":"IFERROR(BB5*100/SUM(BB4:BB15), 0)","v":0},{"$f":"IF((BB5>0),RANK(BB5,BB4:BB15,0),\"SIN RANGO\")","v":"SIN RANGO"},null,{"$f":"IFERROR(AVERAGEIF(C5:AZ5, \">1\"), 1)","v":1},{"$f":"IFERROR(STDEV(IF(C5:AZ5<>1, C5:AZ5, \"\")), 0)","v":0},{"$f":"IFERROR(MEDIAN(IF(C5:AZ5<>1, C5:AZ5, \"\")), 1)","v":1},{"$f":"IF((BF5>1),RANK(BF5,$BF$4:$BF$15,0),\"SIN RANGO\")","v":"SIN RANGO"},null,{"$f":"BB5","v":0}]
[null,{"$f":"User01!B15","v":"FASCINACIÓN"},{"$f":"User01!$H103","v":1},{"$f":"User02!$H103","v":1},{"$f":"User03!$H103","v":1},{"$f":"User04!$H103","v":1},{"$f":"User05!$H103","v":1},{"$f":"User06!$H103","v":1},{"$f":"User07!$H103","v":1},{"$f":"User08!$H103","v":1},{"$f":"User09!$H103","v":1},{"$f":"User10!$H103","v":1},{"$f":"User11!$H103","v":1},{"$f":"User12!$H103","v":1},{"$f":"User13!$H103","v":1},{"$f":"User14!$H103","v":1},{"$f":"User15!$H103","v":1},{"$f":"User16!$H103","v":1},{"$f":"User17!$H103","v":1},{"$f":"User18!$H103","v":1},{"$f":"User19!$H103","v":1},{"$f":"User20!$H103","v":1},{"$f":"User21!$H103","v":1},{"$f":"User22!$H103","v":1},{"$f":"User23!$H103","v":1},{"$f":"User24!$H103","v":1},{"$f":"User25!$H103","v":1},{"$f":"User26!$H103","v":1},{"$f":"User27!$H103","v":1},{"$f":"User28!$H103","v":1},{"$f":"User29!$H103","v":1},{"$f":"User30!$H103","v":1},{"$f":"User31!$H103","v":1},{"$f":"User32!$H103","v":1},{"$f":"User33!$H103","v":1},{"$f":"User34!$H103","v":1},{"$f":"User35!$H103","v":1},{"$f":"User36!$H103","v":1},{"$f":"User37!$H103","v":1},{"$f":"User38!$H103","v":1},{"$f":"User39!$H103","v":1},{"$f":"User40!$H103","v":1},{"$f":"User41!$H103","v":1},{"$f":"User42!$H103","v":1},{"$f":"User43!$H103","v":1},{"$f":"User44!$H103","v":1},{"$f":"User45!$H103","v":1},{"$f":"User46!$H103","v":1},{"$f":"User47!$H103","v":1},{"$f":"User48!$H103","v":1},{"$f":"User49!$H103","v":1},{"$f":"User50!$H103","v":1},null,0,{"$f":"IFERROR(BB6*100/SUM(BB4:BB15), 0)","v":0},{"$f":"IF((BB6>0),RANK(BB6,BB4:BB15,0),\"SIN RANGO\")","v":"SIN RANGO"},null,1,{"$f":"IFERROR(STDEV(IF(C6:AZ6<>1, C6:AZ6, \"\")), 0)","v":0},{"$f":"IFERROR(MEDIAN(IF(C6:AZ6<>1, C6:AZ6, \"\")), 1)","v":1},"SIN RANGO",null,0]
[null,{"$f":"User01!B16","v":"ABURRIMIENTO"},{"$f":"User01!$H104","v":1},{"$f":"User02!$H104","v":1},{"$f":"User03!$H104","v":1},{"$f":"User04!$H104","v":1},{"$f":"User05!$H104","v":1},{"$f":"User06!$H104","v":1},{"$f":"User07!$H104","v":1},{"$f":"User08!$H104","v":1},{"$f":"User09!$H104","v":1},{"$f":"User10!$H104","v":1},{"$f":"User11!$H104","v":1},{"$f":"User12!$H104","v":1},{"$f":"User13!$H104","v":1},{"$f":"User14!$H104","v":1},{"$f":"User15!$H104","v":1},{"$f":"User16!$H104","v":1},{"$f":"User17!$H104","v":1},{"$f":"User18!$H104","v":1},{"$f":"User19!$H104","v":1},{"$f":"User20!$H104","v":1},{"$f":"User21!$H104","v":1},{"$f":"User22!$H104","v":1},{"$f":"User23!$H104","v":1},{"$f":"User24!$H104","v":1},{"$f":"User25!$H104","v":1},{"$f":"User26!$H104","v":1},{"$f":"User27!$H104","v":1},{"$f":"User28!$H104","v":1},{"$f":"User29!$H104","v":1},{"$f":"User30!$H104","v":1},{"$f":"User31!$H104","v":1},{"$f":"User32!$H104","v":1},{"$f":"User33!$H104","v":1},{"$f":"User34!$H104","v":1},{"$f":"User35!$H104","v":1},{"$f":"User36!$H104","v":1},{"$f":"User37!$H104","v":1},{"$f":"User38!$H104","v":1},{"$f":"User39!$H104","v":1},{"$f":"User40!$H104","v":1},{"$f":"User41!$H104","v":1},{"$f":"User42!$H104","v":1},{"$f":"User43!$H104","v":1},{"$f":"User44!$H104","v":1},{"$f":"User45!$H104","v":1},{"$f":"User46!$H104","v":1},{"$f":"User47!$H104","v":1},{"$f":"User48!$H104","v":1},{"$f":"User49!$H104","v":1},{"$f":"User50!$H104","v":1},null,0,{"$f":"IFERROR(BB7*100/SUM(BB4:BB15), 0)","v":0},{"$f":"IF((BB7>0),RANK(BB7,BB4:BB15,0),\"SIN RANGO\")","v":"SIN RANGO"},null,1,{"$f":"IFERROR(STDEV(IF(C7:AZ7<>1, C7:AZ7, \"\")), 0)","v":0},{"$f":"IFERROR(MEDIAN(IF(C7:AZ7<>1, C7:AZ7, \"\")), 1)","v":1},"SIN RANGO",null,null,{"$f":"BB7:BB12","v":0}]
[null,{"$f":"User01!B17","v":"ENFADO"},{"$f":"User01!$H105","v":1},{"$f":"User02!$H105","v":1},{"$f":"User03!$H105","v":1},{"$f":"User04!$H105","v":1},{"$f":"User05!$H105","v":1},{"$f":"User06!$H105","v":1},{"$f":"User07!$H105","v":1},{"$f":"User08!$H105","v":1},{"$f":"User09!$H105","v":1},{"$f":"User10!$H105","v":1},{"$f":"User11!$H105","v":1},{"$f":"User12!$H105","v":1},{"$f":"User13!$H105","v":1},{"$f":"User14!$H105","v":1},{"$f":"User15!$H105","v":1},{"$f":"User16!$H105","v":1},{"$f":"User17!$H105","v":1},{"$f":"User18!$H105","v":1},{"$f":"User19!$H105","v":1},{"$f":"User20!$H105","v":1},{"$f":"User21!$H105","v":1},{"$f":"User22!$H105","v":1},{"$f":"User23!$H105","v":1},{"$f":"User24!$H105","v":1},{"$f":"User25!$H105","v":1},{"$f":"User26!$H105","v":1},{"$f":"User27!$H105","v":1},{"$f":"User28!$H105","v":1},{"$f":"User29!$H105","v":1},{"$f":"User30!$H105","v":1},{"$f":"User31!$H105","v":1},{"$f":"User32!$H105","v":1},{"$f":"User33!$H105","v":1},{"$f":"User34!$H105","v":1},{"$f":"User35!$H105","v":1},{"$f":"User36!$H105","v":1},{"$f":"User37!$H105","v":1},{"$f":"User38!$H105","v":1},{"$f":"User39!$H105","v":1},{"$f":"User40!$H105","v":1},{"$f":"User41!$H105","v":1},{"$f":"User42!$H105","v":1},{"$f":"User43!$H105","v":1},{"$f":"User44!$H105","v":1},{"$f":"User45!$H105","v":1},{"$f":"User46!$H105","v":1},{"$f":"User47!$H105","v":1},{"$f":"User48!$H105","v":1},{"$f":"User49!$H105","v":1},{"$f":"User50!$H105","v":1},null,0,{"$f":"IFERROR(BB8*100/SUM(BB4:BB15), 0)","v":0},{"$f":"IF((BB8>0),RANK(BB8,BB4:BB15,0),\"SIN RANGO\")","v":"SIN RANGO"},null,1,{"$f":"IFERROR(STDEV(IF(C8:AZ8<>1, C8:AZ8, \"\")), 0)","v":0},{"$f":"IFERROR(MEDIAN(IF(C8:AZ8<>1, C8:AZ8, \"\")), 1)","v":1},"SIN RANGO",null,null,{"$f":"BB8:BB13","v":0}]
[null,{"$f":"User01!B18","v":"TRISTEZA"},{"$f":"User01!$H106","v":1},{"$f":"User02!$H106","v":1},{"$f":"User03!$H106","v":1},{"$f":"User04!$H106","v":1},{"$f":"User05!$H106","v":1},{"$f":"User06!$H106","v":1},{"$f":"User07!$H106","v":1},{"$f":"User08!$H106","v":1},{"$f":"User09!$H106","v":1},{"$f":"User10!$H106","v":1},{"$f":"User11!$H106","v":1},{"$f":"User12!$H106","v":1},{"$f":"User13!$H106","v":1},{"$f":"User14!$H106","v":1},{"$f":"User15!$H106","v":1},{"$f":"User16!$H106","v":1},{"$f":"User17!$H106","v":1},{"$f":"User18!$H106","v":1},{"$f":"User19!$H106","v":1},{"$f":"User20!$H106","v":1},{"$f":"User21!$H106","v":1},{"$f":"User22!$H106","v":1},{"$f":"User23!$H106","v":1},{"$f":"User24!$H106","v":1},{"$f":"User25!$H106","v":1},{"$f":"User26!$H106","v":1},{"$f":"User27!$H106","v":1},{"$f":"User28!$H106","v":1},{"$f":"User29!$H106","v":1},{"$f":"User30!$H106","v":1},{"$f":"User31!$H106","v":1},{"$f":"User32!$H106","v":1},{"$f":"User33!$H106","v":1},{"$f":"User34!$H106","v":1},{"$f":"User35!$H106","v":1},{"$f":"User36!$H106","v":1},{"$f":"User37!$H106","v":1},{"$f":"User38!$H106","v":1},{"$f":"User39!$H106","v":1},{"$f":"User40!$H106","v":1},{"$f":"User41!$H106","v":1},{"$f":"User42!$H106","v":1},{"$f":"User43!$H106","v":1},{"$f":"User44!$H106","v":1},{"$f":"User45!$H106","v":1},{"$f":"User46!$H106","v":1},{"$f":"User47!$H106","v":1},{"$f":"User48!$H106","v":1},{"$f":"User49!$H106","v":1},{"$f":"User50!$H106","v":1},null,0,{"$f":"IFERROR(BB9*100/SUM(BB4:BB15), 0)","v":0},{"$f":"IF((BB9>0),RANK(BB9,BB4:BB15,0),\"SIN RANGO\")","v":"SIN RANGO"},null,1,{"$f":"IFERROR(STDEV(IF(C9:AZ9<>1, C9:AZ9, \"\")), 0)","v":0},{"$f":"IFERROR(MEDIAN(IF(C9:AZ9<>1, C9:AZ9, \"\")), 1)","v":1},"SIN RANGO",null,null,0]
[null,{"$f":"User01!B19","v":"VERGÜENZA"},{"$f":"User01!$H107","v":1},{"$f":"User02!$H107","v":1},{"$f":"User03!$H107","v":1},{"$f":"User04!$H107","v":1},{"$f":"User05!$H107","v":1},{"$f":"User06!$H107","v":1},{"$f":"User07!$H107","v":1},{"$f":"User08!$H107","v":1},{"$f":"User09!$H107","v":1},{"$f":"User10!$H107","v":1},{"$f":"User11!$H107","v":1},{"$f":"User12!$H107","v":1},{"$f":"User13!$H107","v":1},{"$f":"User14!$H107","v":1},{"$f":"User15!$H107","v":1},{"$f":"User16!$H107","v":1},{"$f":"User17!$H107","v":1},{"$f":"User18!$H107","v":1},{"$f":"User19!$H107","v":1},{"$f":"User20!$H107","v":1},{"$f":"User21!$H107","v":1},{"$f":"User22!$H107","v":1},{"$f":"User23!$H107","v":1},{"$f":"User24!$H107","v":1},{"$f":"User25!$H107","v":1},{"$f":"User26!$H107","v":1},{"$f":"User27!$H107","v":1},{"$f":"User28!$H107","v":1},{"$f":"User29!$H107","v":1},{"$f":"User30!$H107","v":1},{"$f":"User31!$H107","v":1},{"$f":"User32!$H107","v":1},{"$f":"User33!$H107","v":1},{"$f":"User34!$H107","v":1},{"$f":"User35!$H107","v":1},{"$f":"User36!$H107","v":1},{"$f":"User37!$H107","v":1},{"$f":"User38!$H107","v":1},{"$f":"User39!$H107","v":1},{"$f":"User40!$H107","v":1},{"$f":"User41!$H107","v":1},{"$f":"User42!$H107","v":1},{"$f":"User43!$H107","v":1},{"$f":"User44!$H107","v":1},{"$f":"User45!$H107","v":1},{"$f":"User46!$H107","v":1},{"$f":"User47!$H107","v":1},{"$f":"User48!$H107","v":1},{"$f":"User49!$H107","v":1},{"$f":"User50!$H107","v":1},null,0,{"$f":"IFERROR(BB10*100/SUM(BB4:BB15), 0)","v":0},{"$f":"IF((BB10>0),RANK(BB10,BB4:BB15,0),\"SIN RANGO\")","v":"SIN RANGO"},null,1,{"$f":"IFERROR(STDEV(IF(C10:AZ10<>1, C10:AZ10, \"\")), 0)","v":0},{"$f":"IFERROR(MEDIAN(IF(C10:AZ10<>1, C10:AZ10, \"\")), 1)","v":1},"SIN RANGO",null,null,{"$f":"BB10:BB15","v":0}]
[null,{"$f":"User01!B20","v":"MIEDO"},{"$f":"User01!$H108","v":1},{"$f":"User02!$H108","v":1},{"$f":"User03!$H108","v":1},{"$f":"User04!$H108","v":1},{"$f":"User05!$H108","v":1},{"$f":"User06!$H108","v":1},{"$f":"User07!$H108","v":1},{"$f":"User08!$H108","v":1},{"$f":"User09!$H108","v":1},{"$f":"User10!$H108","v":1},{"$f":"User11!$H108","v":1},{"$f":"User12!$H108","v":1},{"$f":"User13!$H108","v":1},{"$f":"User14!$H108","v":1},{"$f":"User15!$H108","v":1},{"$f":"User16!$H108","v":1},{"$f":"User17!$H108","v":1},{"$f":"User18!$H108","v":1},{"$f":"User19!$H108","v":1},{"$f":"User20!$H108","v":1},{"$f":"User21!$H108","v":1},{"$f":"User22!$H108","v":1},{"$f":"User23!$H108","v":1},{"$f":"User24!$H108","v":1},{"$f":"User25!$H108","v":1},{"$f":"User26!$H108","v":1},{"$f":"User27!$H108","v":1},{"$f":"User28!$H108","v":1},{"$f":"User29!$H108","v":1},{"$f":"User30!$H108","v":1},{"$f":"User31!$H108","v":1},{"$f":"User32!$H108","v":1},{"$f":"User33!$H108","v":1},{"$f":"User34!$H108","v":1},{"$f":"User35!$H108","v":1},{"$f":"User36!$H108","v":1},{"$f":"User37!$H108","v":1},{"$f":"User38!$H108","v":1},{"$f":"User39!$H108","v":1},{"$f":"User40!$H108","v":1},{"$f":"User41!$H108","v":1},{"$f":"User42!$H108","v":1},{"$f":"User43!$H108","v":1},{"$f":"User44!$H108","v":1},{"$f":"User45!$H108","v":1},{"$f":"User46!$H108","v":1},{"$f":"User47!$H108","v":1},{"$f":"User48!$H108","v":1},{"$f":"User49!$H108","v":1},{"$f":"User50!$H108","v":1},null,0,{"$f":"IFERROR(BB11*100/SUM(BB4:BB15), 0)","v":0},{"$f":"IF((BB11>0),RANK(BB11,BB4:BB15,0),\"SIN RANGO\")","v":"SIN RANGO"},null,1,{"$f":"IFERROR(STDEV(IF(C11:AZ11<>1, C11:AZ11, \"\")), 0)","v":0},{"$f":"IFERROR(MEDIAN(IF(C11:AZ11<>1, C11:AZ11, \"\")), 1)","v":1},"SIN RANGO",null,null,{"$f":"BB11:BB17","v":0}]
[null,{"$f":"User01!B21","v":"REPUGNANCIA"},{"$f":"User01!$H109","v":1},{"$f":"User02!$H109","v":1},{"$f":"User03!$H109","v":1},{"$f":"User04!$H109","v":1},{"$f":"User05!$H109","v":1},{"$f":"User06!$H109","v":1},{"$f":"User07!$H109","v":1},{"$f":"User08!$H109","v":1},{"$f":"User09!$H109","v":1},{"$f":"User10!$H109","v":1},{"$f":"User11!$H109","v":1},{"$f":"User12!$H109","v":1},{"$f":"User13!$H109","v":1},{"$f":"User14!$H109","v":1},{"$f":"User15!$H109","v":1},{"$f":"User16!$H109","v":1},{"$f":"User17!$H109","v":1},{"$f":"User18!$H109","v":1},{"$f":"User19!$H109","v":1},{"$f":"User20!$H109","v":1},{"$f":"User21!$H109","v":1},{"$f":"User22!$H109","v":1},{"$f":"User23!$H109","v":1},{"$f":"User24!$H109","v":1},{"$f":"User25!$H109","v":1},{"$f":"User26!$H109","v":1},{"$f":"User27!$H109","v":1},{"$f":"User28!$H109","v":1},{"$f":"User29!$H109","v":1},{"$f":"User30!$H109","v":1},{"$f":"User31!$H109","v":1},{"$f":"User32!$H109","v":1},{"$f":"User33!$H109","v":1},{"$f":"User34!$H109","v":1},{"$f":"User35!$H109","v":1},{"$f":"User36!$H109","v":1},{"$f":"User37!$H109","v":1},{"$f":"User38!$H109","v":1},{"$f":"User39!$H109","v":1},{"$f":"User40!$H109","v":1},{"$f":"User41!$H109","v":1},{"$f":"User42!$H109","v":1},{"$f":"User43!$H109","v":1},{"$f":"User44!$H109","v":1},{"$f":"User45!$H109","v":1},{"$f":"User46!$H109","v":1},{"$f":"User47!$H109","v":1},{"$f":"User48!$H109","v":1},{"$f":"User49!$H109","v":1},{"$f":"User50!$H109","v":1},null,0,{"$f":"IFERROR(BB12*100/SUM(BB4:BB15), 0)","v":0},{"$f":"IF((BB12>0),RANK(BB12,BB4:BB15,0),\"SIN RANGO\")","v":"SIN RANGO"},null,1,{"$f":"IFERROR(STDEV(IF(C12:AZ12<>1, C12:AZ12, \"\")), 0)","v":0},{"$f":"IFERROR(MEDIAN(IF(C12:AZ12<>1, C12:AZ12, \"\")), 1)","v":1},"SIN RANGO",null,null,{"$f":"BB12:BB18","v":0}]
[null,{"$f":"User01!B22","v":"DESEO"},{"$f":"User01!$H110","v":1},{"$f":"User02!$H110","v":1},{"$f":"User03!$H110","v":1},{"$f":"User04!$H110","v":1},{"$f":"User05!$H110","v":1},{"$f":"User06!$H110","v":1},{"$f":"User07!$H110","v":1},{"$f":"User08!$H110","v":1},{"$f":"User09!$H110","v":1},{"$f":"User10!$H110","v":1},{"$f":"User11!$H110","v":1},{"$f":"User12!$H110","v":1},{"$f":"User13!$H110","v":1},{"$f":"User14!$H110","v":1},{"$f":"User15!$H110","v":1},{"$f":"User16!$H110","v":1},{"$f":"User17!$H110","v":1},{"$f":"User18!$H110","v":1},{"$f":"User19!$H110","v":1},{"$f":"User20!$H110","v":1},{"$f":"User21!$H110","v":1},{"$f":"User22!$H110","v":1},{"$f":"User23!$H110","v":1},{"$f":"User24!$H110","v":1},{"$f":"User25!$H110","v":1},{"$f":"User26!$H110","v":1},{"$f":"User27!$H110","v":1},{"$f":"User28!$H110","v":1},{"$f":"User29!$H110","v":1},{"$f":"User30!$H110","v":1},{"$f":"User31!$H110","v":1},{"$f":"User32!$H110","v":1},{"$f":"User33!$H110","v":1},{"$f":"User34!$H110","v":1},{"$f":"User35!$H110","v":1},{"$f":"User36!$H110","v":1},{"$f":"User37!$H110","v":1},{"$f":"User38!$H110","v":1},{"$f":"User39!$H110","v":1},{"$f":"User40!$H110","v":1},{"$f":"User41!$H110","v":1},{"$f":"User42!$H110","v":1},{"$f":"User43!$H110","v":1},{"$f":"User44!$H110","v":1},{"$f":"User45!$H110","v":1},{"$f":"User46!$H110","v":1},{"$f":"User47!$H110","v":1},{"$f":"User48!$H110","v":1},{"$f":"User49!$H110","v":1},{"$f":"User50!$H110","v":1},null,0,{"$f":"IFERROR(BB13*100/SUM(BB4:BB15), 0)","v":0},{"$f":"IF((BB13>0),RANK(BB13,BB4:BB15,0),\"SIN RANGO\")","v":"SIN RANGO"},null,1,{"$f":"IFERROR(STDEV(IF(C13:AZ13<>1, C13:AZ13, \"\")), 0)","v":0},{"$f":"IFERROR(MEDIAN(IF(C13:AZ13<>1, C13:AZ13, \"\")), 1)","v":1},"SIN RANGO",null,{"$f":"BB13","v":0}]
[null,{"$f":"User01!B23","v":"ESPERANZA"},{"$f":"User01!$H111","v":1},{"$f":"User02!$H111","v":1},{"$f":"User03!$H111","v":1},{"$f":"User04!$H111","v":1},{"$f":"User05!$H111","v":1},{"$f":"User06!$H111","v":1},{"$f":"User07!$H111","v":1},{"$f":"User08!$H111","v":1},{"$f":"User09!$H111","v":1},{"$f":"User10!$H111","v":1},{"$f":"User11!$H111","v":1},{"$f":"User12!$H111","v":1},{"$f":"User13!$H111","v":1},{"$f":"User14!$H111","v":1},{"$f":"User15!$H111","v":1},{"$f":"User16!$H111","v":1},{"$f":"User17!$H111","v":1},{"$f":"User18!$H111","v":1},{"$f":"User19!$H111","v":1},{"$f":"User20!$H111","v":1},{"$f":"User21!$H111","v":1},{"$f":"User22!$H111","v":1},{"$f":"User23!$H111","v":1},{"$f":"User24!$H111","v":1},{"$f":"User25!$H111","v":1},{"$f":"User26!$H111","v":1},{"$f":"User27!$H111","v":1},{"$f":"User28!$H111","v":1},{"$f":"User29!$H111","v":1},{"$f":"User30!$H111","v":1},{"$f":"User31!$H111","v":1},{"$f":"User32!$H111","v":1},{"$f":"User33!$H111","v":1},{"$f":"User34!$H111","v":1},{"$f":"User35!$H111","v":1},{"$f":"User36!$H111","v":1},{"$f":"User37!$H111","v":1},{"$f":"User38!$H111","v":1},{"$f":"User39!$H111","v":1},{"$f":"User40!$H111","v":1},{"$f":"User41!$H111","v":1},{"$f":"User42!$H111","v":1},{"$f":"User43!$H111","v":1},{"$f":"User44!$H111","v":1},{"$f":"User45!$H111","v":1},{"$f":"User46!$H111","v":1},{"$f":"User47!$H111","v":1},{"$f":"User48!$H111","v":1},{"$f":"User49!$H111","v":1},{"$f":"User50!$H111","v":1},null,0,{"$f":"IFERROR(BB14*100/SUM(BB4:BB15), 0)","v":0},{"$f":"IF((BB14>0),RANK(BB14,BB4:BB15,0),\"SIN RANGO\")","v":"SIN RANGO"},null,1,{"$f":"IFERROR(STDEV(IF(C14:AZ14<>1, C14:AZ14, \"\")), 0)","v":0},{"$f":"IFERROR(MEDIAN(IF(C14:AZ14<>1, C14:AZ14, \"\")), 1)","v":1},"SIN RANGO",null,{"$f":"BB14","v":0}]
[null,{"$f":"User01!B24","v":"ORGULLO"},{"$f":"User01!$H112","v":1},{"$f":"User02!$H112","v":1},{"$f":"User03!$H112","v":1},{"$f":"User04!$H112","v":1},{"$f":"User05!$H112","v":1},{"$f":"User06!$H112","v":1},{"$f":"User07!$H112","v":1},{"$f":"User08!$H112","v":1},{"$f":"User09!$H112","v":1},{"$f":"User10!$H112","v":1},{"$f":"User11!$H112","v":1},{"$f":"User12!$H112","v":1},{"$f":"User13!$H112","v":1},{"$f":"User14!$H112","v":1},{"$f":"User15!$H112","v":1},{"$f":"User16!$H112","v":1},{"$f":"User17!$H112","v":1},{"$f":"User18!$H112","v":1},{"$f":"User19!$H112","v":1},{"$f":"User20!$H112","v":1},{"$f":"User21!$H112","v":1},{"$f":"User22!$H112","v":1},{"$f":"User23!$H112","v":1},{"$f":"User24!$H112","v":1},{"$f":"User25!$H112","v":1},{"$f":"User26!$H112","v":1},{"$f":"User27!$H112","v":1},{"$f":"User28!$H112","v":1},{"$f":"User29!$H112","v":1},{"$f":"User30!$H112","v":1},{"$f":"User31!$H112","v":1},{"$f":"User32!$H112","v":1},{"$f":"User33!$H112","v":1},{"$f":"User34!$H112","v":1},{"$f":"User35!$H112","v":1},{"$f":"User36!$H112","v":1},{"$f":"User37!$H112","v":1},{"$f":"User38!$H112","v":1},{"$f":"User39!$H112","v":1},{"$f":"User40!$H112","v":1},{"$f":"User41!$H112","v":1},{"$f":"User42!$H112","v":1},{"$f":"User43!$H112","v":1},{"$f":"User44!$H112","v":1},{"$f":"User45!$H112","v":1},{"$f":"User46!$H112","v":1},{"$f":"User47!$H112","v":1},{"$f":"User48!$H112","v":1},{"$f":"User49!$H112","v":1},{"$f":"User50!$H112","v":1},null,0,{"$f":"IFERROR(BB15*100/SUM(BB4:BB15), 0)","v":0},{"$f":"IF((BB15>0),RANK(BB15,BB4:BB15,0),\"SIN RANGO\")","v":"SIN RANGO"},null,1,{"$f":"IFERROR(STDEV(IF(C15:AZ15<>1, C15:AZ15, \"\")), 0)","v":0},{"$f":"IFERROR(MEDIAN(IF(C15:AZ15<>1, C15:AZ15, \"\")), 1)","v":1},"SIN RANGO",null,0]
[]
[null,null,null,null,null,null,null,null,null,null,null,null,null,null,null,null,null,null,null,null,null,null,null,null,null,null,null,null,null,null,null,null,null,null,null,null,null,null,null,null,null,null,null,null,null,null,null,null,null,null,null,null,null,null,null,null,null,null,null,null,null,null,{"$f":"SUM(BK4:BK15)","v":0},{"$f":"SUM(BL7:BL12)","v":0},"MENCIONES"]
[null,null,null,null,null,null,null,null,null,null,null,null,null,null,null,null,null,null,null,null,null,null,null,null,null,null,null,null,null,null,null,null,null,null,null,null,null,null,null,null,null,null,null,null,null,null,null,null,null,null,null,null,null,null,null,null,null,null,null,null,null,null,{"$f":"IFERROR(BK17*100/(SUM(BK17:BL17)), 0)","v":0},{"$f":"IFERROR(BL17*100/(SUM(BK17:BL17)), 0)","v":0},"PORCENTAJES"]

{"sheet":"COMPARATIVA ENTRE PRODUCTOS","index":57,"n_rows":20,"n_cols":49,"rows_kept":20,"cut":false,"hidden":false,"merged":[[2,21,3,21],[2,14,3,14],[2,13,3,13],[1,2,1,8],[1,9,1,15],[1,32,1,33],[2,17,4,17],[2,18,4,18],[2,19,4,19],[2,23,4,23],[2,30,4,30],[2,33,4,33],[1,17,1,30],[2,5,3,5],[2,12,3,12],[2,6,3,6],[2,7,3,7],[2,29,3,29],[2,22,3,22],[3,35,4,35],[3,36,4,36],[3,47,4,47],[3,48,4,48],[1,35,1,48],[2,35,2,36],[3,38,4,38],[3,37,4,37],[3,39,4,39],[3,40,4,40],[2,37,2,38],[2,39,2,40],[2,47,2,48],[2,41,2,42],[2,43,2,44],[2,45,2,46],[2,1,4,1],[2,32,4,32],[2,8,4,8],[2,15,4,15],[2,2,4,2],[2,9,4,9],[2,3,4,3],[2,10,4,10],[2,4,4,4],[2,11,4,11],[2,24,4,24],[2,25,4,25],[2,26,4,26],[2,20,3,20],[2,27,3,27],[2,28,3,28]]}
[]
[null,null,"INTENSIDADES (MEDIA)",null,null,null,null,null,null,"INTENSIDADES (MEDIANA)",null,null,null,null,null,null,null,"FRECUENCIAS",null,null,null,null,null,null,null,null,null,null,null,null,null,null,"JERARQUÍAS",null,null,"TONO EMOCIONAL"]
[null,"EMOCIONES/PRODUCTOS","MEDIA ITEM A","MEDIA ITEM B","MEDIA  ITEM C","MEDIA ITEM D","MEDIA ITEM E","MEDIA ITEM F","MEDIA GENERAL","MEDIANA ITEM A","MEDIANA ITEM B","MEDIANA ITEM C","MEDIANA ITEM D","MEDIANA ITEM E","MEDIANA ITEM F","MEDIANA GENERAL",null,"FRECUENCIA MENCIONES ITEM A","FRECUENCIA MENCIONES ITEM B","FRECUENCIA MENCIONES ITEM C","FRECUENCIA MENCIONES ITEM D","FRECUENCIA MENCIONES ITEM E","FRECUENCIA MENCIONES ITEM F","MEDIA FRECUENCIA MENCIONES","% MENCIONES ITEM A","% MENCIONES ITEM B","% MENCIONES ITEM C","% MENCIONES ITEM D","% MENCIONES ITEM E","% MENCIONES ITEM F","MEDIA % MENCIONES",null,"JERARQUÍA INTENSIDAD (MEDIA)","JERARQUÍA FRECUENCIA (MEDIA)",null,"ITEM A",null,"ITEM B",null,"ITEM C",null,"ITEM D",null,"ITEM E",null,"ITEM F",null,"TOTALES"]
[null,null,null,null,null,null,null,null,null,null,null,null,null,null,null,null,null,null,null,null,null,null,null,null,null,null,null,null,null,null,null,null,null,null,null,"POSITIVAS","NEGATIVAS","POSITIVAS","NEGATIVAS","POSITIVAS","NEGATIVAS","POSITIVAS","NEGATIVAS","POSITIVAS","NEGATIVAS","POSITIVAS","NEGATIVAS","POSITIVAS","NEGATIVAS"]
[]
[null,{"$f":"User01!B13","v":"ALEGRÍA"},{"$f":"ItemA!BF4","v":1},{"$f":"ItemB!BF4","v":1},{"$f":"ItemC!BF4","v":1},{"$f":"ItemD!BF4","v":1},{"$f":"ItemE!BF4","v":1},{"$f":"ItemF!BF4","v":1},{"$f":"IFERROR(SUMIF(C6:H6,\">1\")/COUNTIF(C6:H6,\">1\"), 1)","v":1},{"$f":"ItemA!BH4","v":1},{"$f":"ItemB!BH4","v":1},{"$f":"ItemC!BH4","v":1},{"$f":"ItemD!BH4","v":1},{"$f":"ItemE!BH4","v":1},{"$f":"ItemF!BH4","v":1},{"$f":"IFERROR(SUMIF(J6:O6,\">1\")/COUNTIF(J6:O6,\">1\"), 1)","v":1},null,{"$f":"ItemA!BB4","v":0},{"$f":"ItemB!BB4","v":0},{"$f":"ItemC!BB4","v":0},{"$f":"ItemD!BB4","v":0},{"$f":"ItemE!BB4","v":0},{"$f":"ItemF!BB4","v":0},{"$f":"IFERROR(SUMIF(R6:W6,\">1\")/COUNTIF(R6:W6,\">1\"), 0)","v":0},{"$f":"ItemA!BC4","v":0},{"$f":"ItemB!BC4","v":0},{"$f":"ItemC!BC4","v":0},{"$f":"ItemD!BC4","v":0},{"$f":"ItemE!BC4","v":0},{"$f":"ItemF!BC4","v":0},{"$f":"IFERROR(SUMIF(Y6:AD6,\">1\")/COUNTIF(Y6:AD6,\">1\"), 0)","v":0},null,{"$f":"IF((I6>1),RANK(I6,I6:I17,0),\"SIN RANGO\")","v":"SIN RANGO"},{"$f":"IF((X6>1),RANK(X6,X6:X17,0),\"SIN RANGO\")","v":"SIN RANGO"},null,{"$f":"ItemA!$BK$4","v":0},{"$f":"ItemA!$BL$4","v":0},{"$f":"ItemB!$BK4","v":0},{"$f":"ItemB!$BL4","v":0},{"$f":"ItemC!$BK$4","v":0},{"$f":"ItemC!$BL4","v":0},{"$f":"ItemD!$BK4","v":0},{"$f":"ItemD!$BL4","v":0},{"$f":"ItemE!$BK4","v":0},{"$f":"ItemE!$BL4","v":0},{"$f":"ItemF!$BK4","v":0},{"$f":"ItemF!$BL4","v":0},{"$f":"SUM(AJ6,AL6,AN6,AP6,AR6,AT6)","v":0},{"$f":"SUM(AK6,AM6,AO6,AQ6,AS6,AU6)","v":0}]
[null,{"$f":"User01!B14","v":"SATISFACCIÓN"},{"$f":"ItemA!BF5","v":1},{"$f":"ItemB!BF5","v":1},{"$f":"ItemC!BF5","v":1},{"$f":"ItemD!BF5","v":1},{"$f":"ItemE!BF5","v":1},{"$f":"ItemF!BF5","v":1},{"$f":"IFERROR(SUMIF(C7:H7,\">1\")/COUNTIF(C7:H7,\">1\"), 1)","v":1},{"$f":"ItemA!BH5","v":1},{"$f":"ItemB!BH5","v":1},{"$f":"ItemC!BH5","v":1},{"$f":"ItemD!BH5","v":1},{"$f":"ItemE!BH5","v":1},{"$f":"ItemF!BH5","v":1},{"$f":"IFERROR(SUMIF(J7:O7,\">1\")/COUNTIF(J7:O7,\">1\"), 1)","v":1},null,{"$f":"ItemA!BB5","v":0},{"$f":"ItemB!BB5","v":0},{"$f":"ItemC!BB5","v":0},{"$f":"ItemD!BB5","v":0},{"$f":"ItemE!BB5","v":0},{"$f":"ItemF!BB5","v":0},{"$f":"IFERROR(SUMIF(R7:W7,\">1\")/COUNTIF(R7:W7,\">1\"), 0)","v":0},{"$f":"ItemA!BC5","v":0},{"$f":"ItemB!BC5","v":0},{"$f":"ItemC!BC5","v":0},{"$f":"ItemD!BC5","v":0},{"$f":"ItemE!BC5","v":0},{"$f":"ItemF!BC5","v":0},{"$f":"IFERROR(SUMIF(Y7:AD7,\">1\")/COUNTIF(Y7:AD7,\">1\"), 0)","v":0},null,{"$f":"IF((I7>1),RANK(I7,I6:I17,0),\"SIN RANGO\")","v":"SIN RANGO"},{"$f":"IF((X7>1),RANK(X7,X6:X17,0),\"SIN RANGO\")","v":"SIN RANGO"},null,{"$f":"ItemA!$BK5","v":0},{"$f":"ItemA!BL5","v":0},{"$f":"ItemB!$BK5","v":0},{"$f":"ItemB!$BL5","v":0},{"$f":"ItemC!$BK$4","v":0},{"$f":"ItemC!$BL5","v":0},{"$f":"ItemD!$BK5","v":0},{"$f":"ItemD!$BL5","v":0},{"$f":"ItemE!$BK5","v":0},{"$f":"ItemE!$BL5","v":0},{"$f":"ItemF!$BK5","v":0},{"$f":"ItemF!$BL5","v":0},{"$f":"SUM(AJ7,AL7,AN7,AP7,AR7,AT7)","v":0},{"$f":"SUM(AK7,AM7,AO7,AQ7,AS7,AU7)","v":0}]
[null,{"$f":"User01!B15","v":"FASCINACIÓN"},{"$f":"ItemA!BF6","v":1},{"$f":"ItemB!BF6","v":1},{"$f":"ItemC!BF6","v":1},{"$f":"ItemD!BF6","v":1},{"$f":"ItemE!BF6","v":1},{"$f":"ItemF!BF6","v":1},1,{"$f":"ItemA!BH6","v":1},{"$f":"ItemB!BH6","v":1},{"$f":"ItemC!BH6","v":1},{"$f":"ItemD!BH6","v":1},{"$f":"ItemE!BH6","v":1},{"$f":"ItemF!BH6","v":1},1,null,{"$f":"ItemA!BB6","v":0},{"$f":"ItemB!BB6","v":0},{"$f":"ItemC!BB6","v":0},{"$f":"ItemD!BB6","v":0},{"$f":"ItemE!BB6","v":0},{"$f":"ItemF!BB6","v":0},0,{"$f":"ItemA!BC6","v":0},{"$f":"ItemB!BC6","v":0},{"$f":"ItemC!BC6","v":0},{"$f":"ItemD!BC6","v":0},{"$f":"ItemE!BC6","v":0},{"$f":"ItemF!BC6","v":0},0,null,{"$f":"IF((I8>1),RANK(I8,I6:I17,0),\"SIN RANGO\")","v":"SIN RANGO"},{"$f":"IF((X8>1),RANK(X8,X6:X17,0),\"SIN RANGO\")","v":"SIN RANGO"},null,{"$f":"ItemA!$BK6","v":0},{"$f":"ItemA!BL6","v":0},{"$f":"ItemB!$BK6","v":0},{"$f":"ItemB!$BL6","v":0},{"$f":"ItemC!$BK$4","v":0},{"$f":"ItemC!$BL6","v":0},{"$f":"ItemD!$BK6","v":0},{"$f":"ItemD!$BL6","v":0},{"$f":"ItemE!$BK6","v":0},{"$f":"ItemE!$BL6","v":0},{"$f":"ItemF!$BK6","v":0},{"$f":"ItemF!$BL6","v":0},0,0]
[null,{"$f":"User01!B16","v":"ABURRIMIENTO"},{"$f":"ItemA!BF7","v":1},{"$f":"ItemB!BF7","v":1},{"$f":"ItemC!BF7","v":1},{"$f":"ItemD!BF7","v":1},{"$f":"ItemE!BF7","v":1},{"$f":"ItemF!BF7","v":1},1,{"$f":"ItemA!BH7","v":1},{"$f":"ItemB!BH7","v":1},{"$f":"ItemC!BH7","v":1},{"$f":"ItemD!BH7","v":1},{"$f":"ItemE!BH7","v":1},{"$f":"ItemF!BH7","v":1},1,null,{"$f":"ItemA!BB7","v":0},{"$f":"ItemB!BB7","v":0},{"$f":"ItemC!BB7","v":0},{"$f":"ItemD!BB7","v":0},{"$f":"ItemE!BB7","v":0},{"$f":"ItemF!BB7","v":0},0,{"$f":"ItemA!BC7","v":0},{"$f":"ItemB!BC7","v":0},{"$f":"ItemC!BC7","v":0},{"$f":"ItemD!BC7","v":0},{"$f":"ItemE!BC7","v":0},{"$f":"ItemF!BC7","v":0},0,null,{"$f":"IF((I9>1),RANK(I9,I6:I17,0),\"SIN RANGO\")","v":"SIN RANGO"},{"$f":"IF((X9>1),RANK(X9,X6:X17,0),\"SIN RANGO\")","v":"SIN RANGO"},null,{"$f":"ItemA!$BK7","v":0},{"$f":"ItemA!BL7","v":0},{"$f":"ItemB!$BK7","v":0},{"$f":"ItemB!$BL7","v":0},{"$f":"ItemC!$BK$4","v":0},{"$f":"ItemC!$BL7","v":0},{"$f":"ItemD!$BK7","v":0},{"$f":"ItemD!$BL7","v":0},{"$f":"ItemE!$BK7","v":0},{"$f":"ItemE!$BL7","v":0},{"$f":"ItemF!$BK7","v":0},{"$f":"ItemF!$BL7","v":0},0,0]
[null,{"$f":"User01!B17","v":"ENFADO"},{"$f":"ItemA!BF8","v":1},{"$f":"ItemB!BF8","v":1},{"$f":"ItemC!BF8","v":1},{"$f":"ItemD!BF8","v":1},{"$f":"ItemE!BF8","v":1},{"$f":"ItemF!BF8","v":1},1,{"$f":"ItemA!BH8","v":1},{"$f":"ItemB!BH8","v":1},{"$f":"ItemC!BH8","v":1},{"$f":"ItemD!BH8","v":1},{"$f":"ItemE!BH8","v":1},{"$f":"ItemF!BH8","v":1},1,null,{"$f":"ItemA!BB8","v":0},{"$f":"ItemB!BB8","v":0},{"$f":"ItemC!BB8","v":0},{"$f":"ItemD!BB8","v":0},{"$f":"ItemE!BB8","v":0},{"$f":"ItemF!BB8","v":0},0,{"$f":"ItemA!BC8","v":0},{"$f":"ItemB!BC8","v":0},{"$f":"ItemC!BC8","v":0},{"$f":"ItemD!BC8","v":0},{"$f":"ItemE!BC8","v":0},{"$f":"ItemF!BC8","v":0},0,null,{"$f":"IF((I10>1),RANK(I10,I6:I17,0),\"SIN RANGO\")","v":"SIN RANGO"},{"$f":"IF((X10>1),RANK(X10,X6:X17,0),\"SIN RANGO\")","v":"SIN RANGO"},null,{"$f":"ItemA!$BK8","v":0},{"$f":"ItemA!BL8","v":0},{"$f":"ItemB!$BK8","v":0},{"$f":"ItemB!$BL8","v":0},{"$f":"ItemC!$BK$4","v":0},{"$f":"ItemC!$BL8","v":0},{"$f":"ItemD!$BK8","v":0},{"$f":"ItemD!$BL8","v":0},{"$f":"ItemE!$BK8","v":0},{"$f":"ItemE!$BL8","v":0},{"$f":"ItemF!$BK8","v":0},{"$f":"ItemF!$BL8","v":0},0,0]
[null,{"$f":"User01!B18","v":"TRISTEZA"},{"$f":"ItemA!BF9","v":1},{"$f":"ItemB!BF9","v":1},{"$f":"ItemC!BF9","v":1},{"$f":"ItemD!BF9","v":1},{"$f":"ItemE!BF9","v":1},{"$f":"ItemF!BF9","v":1},1,{"$f":"ItemA!BH9","v":1},{"$f":"ItemB!BH9","v":1},{"$f":"ItemC!BH9","v":1},{"$f":"ItemD!BH9","v":1},{"$f":"ItemE!BH9","v":1},{"$f":"ItemF!BH9","v":1},1,null,{"$f":"ItemA!BB9","v":0},{"$f":"ItemB!BB9","v":0},{"$f":"ItemC!BB9","v":0},{"$f":"ItemD!BB9","v":0},{"$f":"ItemE!BB9","v":0},{"$f":"ItemF!BB9","v":0},0,{"$f":"ItemA!BC9","v":0},{"$f":"ItemB!BC9","v":0},{"$f":"ItemC!BC9","v":0},{"$f":"ItemD!BC9","v":0},{"$f":"ItemE!BC9","v":0},{"$f":"ItemF!BC9","v":0},0,null,{"$f":"IF((I11>1),RANK(I11,I6:I17,0),\"SIN RANGO\")","v":"SIN RANGO"},{"$f":"IF((X11>1),RANK(X11,X6:X17,0),\"SIN RANGO\")","v":"SIN RANGO"},null,{"$f":"ItemA!$BK9","v":0},{"$f":"ItemA!BL9","v":0},{"$f":"ItemB!$BK9","v":0},{"$f":"ItemB!$BL9","v":0},{"$f":"ItemC!$BK$4","v":0},{"$f":"ItemC!$BL9","v":0},{"$f":"ItemD!$BK9","v":0},{"$f":"ItemD!$BL9","v":0},{"$f":"ItemE!$BK9","v":0},{"$f":"ItemE!$BL9","v":0},{"$f":"ItemF!$BK9","v":0},{"$f":"ItemF!$BL9","v":0},0,0]
[null,{"$f":"User01!B19","v":"VERGÜENZA"},{"$f":"ItemA!BF10","v":1},{"$f":"ItemB!BF10","v":1},{"$f":"ItemC!BF10","v":1},{"$f":"ItemD!BF10","v":1},{"$f":"ItemE!BF10","v":1},{"$f":"ItemF!BF10","v":1},1,{"$f":"ItemA!BH10","v":1},{"$f":"ItemB!BH10","v":1},{"$f":"ItemC!BH10","v":1},{"$f":"ItemD!BH10","v":1},{"$f":"ItemE!BH10","v":1},{"$f":"ItemF!BH10","v":1},1,null,{"$f":"ItemA!BB10","v":0},{"$f":"ItemB!BB10","v":0},{"$f":"ItemC!BB10","v":0},{"$f":"ItemD!BB10","v":0},{"$f":"ItemE!BB10","v":0},{"$f":"ItemF!BB10","v":0},0,{"$f":"ItemA!BC10","v":0},{"$f":"ItemB!BC10","v":0},{"$f":"ItemC!BC10","v":0},{"$f":"ItemD!BC10","v":0},{"$f":"ItemE!BC10","v":0},{"$f":"ItemF!BC10","v":0},0,null,{"$f":"IF((I12>1),RANK(I12,I6:I17,0),\"SIN RANGO\")","v":"SIN RANGO"},{"$f":"IF((X12>1),RANK(X12,X6:X17,0),\"SIN RANGO\")","v":"SIN RANGO"},null,{"$f":"ItemA!$BK10","v":0},{"$f":"ItemA!BL10","v":0},{"$f":"ItemB!$BK10","v":0},{"$f":"ItemB!$BL10","v":0},{"$f":"ItemC!$BK$4","v":0},{"$f":"ItemC!$BL10","v":0},{"$f":"ItemD!$BK10","v":0},{"$f":"ItemD!$BL10","v":0},{"$f":"ItemE!$BK10","v":0},{"$f":"ItemE!$BL10","v":0},{"$f":"ItemF!$BK10","v":0},{"$f":"ItemF!$BL10","v":0},0,0]
[null,{"$f":"User01!B20","v":"MIEDO"},{"$f":"ItemA!BF11","v":1},{"$f":"ItemB!BF11","v":1},{"$f":"ItemC!BF11","v":1},{"$f":"ItemD!BF11","v":1},{"$f":"ItemE!BF11","v":1},{"$f":"ItemF!BF11","v":1},1,{"$f":"ItemA!BH11","v":1},{"$f":"ItemB!BH11","v":1},{"$f":"ItemC!BH11","v":1},{"$f":"ItemD!BH11","v":1},{"$f":"ItemE!BH11","v":1},{"$f":"ItemF!BH11","v":1},1,null,{"$f":"ItemA!BB11","v":0},{"$f":"ItemB!BB11","v":0},{"$f":"ItemC!BB11","v":0},{"$f":"ItemD!BB11","v":0},{"$f":"ItemE!BB11","v":0},{"$f":"ItemF!BB11","v":0},0,{"$f":"ItemA!BC11","v":0},{"$f":"ItemB!BC11","v":0},{"$f":"ItemC!BC11","v":0},{"$f":"ItemD!BC11","v":0},{"$f":"ItemE!BC11","v":0},{"$f":"ItemF!BC11","v":0},0,null,{"$f":"IF((I13>1),RANK(I13,I6:I17,0),\"SIN RANGO\")","v":"SIN RANGO"},{"$f":"IF((X13>1),RANK(X13,X6:X17,0),\"SIN RANGO\")","v":"SIN RANGO"},null,{"$f":"ItemA!$BK11","v":0},{"$f":"ItemA!BL11","v":0},{"$f":"ItemB!$BK11","v":0},{"$f":"ItemB!$BL11","v":0},{"$f":"ItemC!$BK$4","v":0},{"$f":"ItemC!$BL11","v":0},{"$f":"ItemD!$BK11","v":0},{"$f":"ItemD!$BL11","v":0},{"$f":"ItemE!$BK11","v":0},{"$f":"ItemE!$BL11","v":0},{"$f":"ItemF!$BK11","v":0},{"$f":"ItemF!$BL11","v":0},0,0]
[null,{"$f":"User01!B21","v":"REPUGNANCIA"},{"$f":"ItemA!BF12","v":1},{"$f":"ItemB!BF12","v":1},{"$f":"ItemC!BF12","v":1},{"$f":"ItemD!BF12","v":1},{"$f":"ItemE!BF12","v":1},{"$f":"ItemF!BF12","v":1},1,{"$f":"ItemA!BH12","v":1},{"$f":"ItemB!BH12","v":1},{"$f":"ItemC!BH12","v":1},{"$f":"ItemD!BH12","v":1},{"$f":"ItemE!BH12","v":1},{"$f":"ItemF!BH12","v":1},1,null,{"$f":"ItemA!BB12","v":0},{"$f":"ItemB!BB12","v":0},{"$f":"ItemC!BB12","v":0},{"$f":"ItemD!BB12","v":0},{"$f":"ItemE!BB12","v":0},{"$f":"ItemF!BB12","v":0},0,{"$f":"ItemA!BC12","v":0},{"$f":"ItemB!BC12","v":0},{"$f":"ItemC!BC12","v":0},{"$f":"ItemD!BC12","v":0},{"$f":"ItemE!BC12","v":0},{"$f":"ItemF!BC12","v":0},0,null,{"$f":"IF((I14>1),RANK(I14,I6:I17,0),\"SIN RANGO\")","v":"SIN RANGO"},{"$f":"IF((X14>1),RANK(X14,X6:X17,0),\"SIN RANGO\")","v":"SIN RANGO"},null,{"$f":"ItemA!$BK12","v":0},{"$f":"ItemA!BL12","v":0},{"$f":"ItemB!$BK12","v":0},{"$f":"ItemB!$BL12","v":0},{"$f":"ItemC!$BK$4","v":0},{"$f":"ItemC!$BL12","v":0},{"$f":"ItemD!$BK12","v":0},{"$f":"ItemD!$BL12","v":0},{"$f":"ItemE!$BK12","v":0},{"$f":"ItemE!$BL12","v":0},{"$f":"ItemF!$BK12","v":0},{"$f":"ItemF!$BL12","v":0},0,0]
[null,{"$f":"User01!B22","v":"DESEO"},{"$f":"ItemA!BF13","v":1},{"$f":"ItemB!BF13","v":1},{"$f":"ItemC!BF13","v":1},{"$f":"ItemD!BF13","v":1},{"$f":"ItemE!BF13","v":1},{"$f":"ItemF!BF13","v":1},1,{"$f":"ItemA!BH13","v":1},{"$f":"ItemB!BH13","v":1},{"$f":"ItemC!BH13","v":1},{"$f":"ItemD!BH13","v":1},{"$f":"ItemE!BH13","v":1},{"$f":"ItemF!BH13","v":1},1,null,{"$f":"ItemA!BB13","v":0},{"$f":"ItemB!BB13","v":0},{"$f":"ItemC!BB13","v":0},{"$f":"ItemD!BB13","v":0},{"$f":"ItemE!BB13","v":0},{"$f":"ItemF!BB13","v":0},0,{"$f":"ItemA!BC13","v":0},{"$f":"ItemB!BC13","v":0},{"$f":"ItemC!BC13","v":0},{"$f":"ItemD!BC13","v":0},{"$f":"ItemE!BC13","v":0},{"$f":"ItemF!BC13","v":0},0,null,{"$f":"IF((I15>1),RANK(I15,I6:I17,0),\"SIN RANGO\")","v":"SIN RANGO"},{"$f":"IF((X15>1),RANK(X15,X6:X17,0),\"SIN RANGO\")","v":"SIN RANGO"},null,{"$f":"ItemA!$BK13","v":0},{"$f":"ItemA!BL13","v":0},{"$f":"ItemB!$BK13","v":0},{"$f":"ItemB!$BL13","v":0},{"$f":"ItemC!$BK$4","v":0},{"$f":"ItemC!$BL13","v":0},{"$f":"ItemD!$BK13","v":0},{"$f":"ItemD!$BL13","v":0},{"$f":"ItemE!$BK13","v":0},{"$f":"ItemE!$BL13","v":0},{"$f":"ItemF!$BK13","v":0},{"$f":"ItemF!$BL13","v":0},0,0]
[null,{"$f":"User01!B23","v":"ESPERANZA"},{"$f":"ItemA!BF14","v":1},{"$f":"ItemB!BF14","v":1},{"$f":"ItemC!BF14","v":1},{"$f":"ItemD!BF14","v":1},{"$f":"ItemE!BF14","v":1},{"$f":"ItemF!BF14","v":1},1,{"$f":"ItemA!BH14","v":1},{"$f":"ItemB!BH14","v":1},{"$f":"ItemC!BH14","v":1},{"$f":"ItemD!BH14","v":1},{"$f":"ItemE!BH14","v":1},{"$f":"ItemF!BH14","v":1},1,null,{"$f":"ItemA!BB14","v":0},{"$f":"ItemB!BB14","v":0},{"$f":"ItemC!BB14","v":0},{"$f":"ItemD!BB14","v":0},{"$f":"ItemE!BB14","v":0},{"$f":"ItemF!BB14","v":0},0,{"$f":"ItemA!BC14","v":0},{"$f":"ItemB!BC14","v":0},{"$f":"ItemC!BC14","v":0},{"$f":"ItemD!BC14","v":0},{"$f":"ItemE!BC14","v":0},{"$f":"ItemF!BC14","v":0},0,null,{"$f":"IF((I16>1),RANK(I16,I6:I17,0),\"SIN RANGO\")","v":"SIN RANGO"},{"$f":"IF((X16>1),RANK(X16,X6:X17,0),\"SIN RANGO\")","v":"SIN RANGO"},null,{"$f":"ItemA!BK14","v":0},{"$f":"ItemA!BL14","v":0},{"$f":"ItemB!$BK14","v":0},{"$f":"ItemB!$BL14","v":0},{"$f":"ItemC!$BK$4","v":0},{"$f":"ItemC!$BL14","v":0},{"$f":"ItemD!$BK14","v":0},{"$f":"ItemD!$BL14","v":0},{"$f":"ItemE!$BK14","v":0},{"$f":"ItemE!$BL14","v":0},{"$f":"ItemF!$BK14","v":0},{"$f":"ItemF!$BL14","v":0},0,0]
[null,{"$f":"User01!B24","v":"ORGULLO"},{"$f":"ItemA!BF15","v":1},{"$f":"ItemB!BF15","v":1},{"$f":"ItemC!BF15","v":1},{"$f":"ItemD!BF15","v":1},{"$f":"ItemE!BF15","v":1},{"$f":"ItemF!BF15","v":1},1,{"$f":"ItemA!BH15","v":1},{"$f":"ItemB!BH15","v":1},{"$f":"ItemC!BH15","v":1},{"$f":"ItemD!BH15","v":1},{"$f":"ItemE!BH15","v":1},{"$f":"ItemF!BH15","v":1},1,null,{"$f":"ItemA!BB15","v":0},{"$f":"ItemB!BB15","v":0},{"$f":"ItemC!BB15","v":0},{"$f":"ItemD!BB15","v":0},{"$f":"ItemE!BB15","v":0},{"$f":"ItemF!BB15","v":0},0,{"$f":"ItemA!BC15","v":0},{"$f":"ItemB!BC15","v":0},{"$f":"ItemC!BC15","v":0},{"$f":"ItemD!BC15","v":0},{"$f":"ItemE!BC15","v":0},{"$f":"ItemF!BC15","v":0},0,null,{"$f":"IF((I17>1),RANK(I17,I6:I17,0),\"SIN RANGO\")","v":"SIN RANGO"},{"$f":"IF((X17>1),RANK(X17,X6:X17,0),\"SIN RANGO\")","v":"SIN RANGO"},null,{"$f":"ItemA!BK15","v":0},{"$f":"ItemA!BL15","v":0},{"$f":"ItemB!$BK15","v":0},{"$f":"ItemB!$BL15","v":0},{"$f":"ItemC!$BK$4","v":0},{"$f":"ItemC!$BL15","v":0},{"$f":"ItemD!$BK15","v":0},{"$f":"ItemD!$BL15","v":0},{"$f":"ItemE!$BK15","v":0},{"$f":"ItemE!$BL15","v":0},{"$f":"ItemF!$BK15","v":0},{"$f":"ItemF!$BL15","v":0},0,0]
[]
[null,null,null,null,null,null,null,null,null,null,null,null,null,null,null,null,null,null,null,null,null,null,null,null,null,null,null,null,null,null,null,null,null,null,null,{"$f":"ItemA!$BK$17","v":0},{"$f":"ItemA!$BL$17","v":0},{"$f":"ItemB!$BK$17","v":0},{"$f":"ItemB!$BL$17","v":0},{"$f":"ItemC!$BK$17","v":0},{"$f":"ItemC!$BL$17","v":0},{"$f":"ItemD!$BK$17","v":0},{"$f":"ItemD!$BL$17","v":0},{"$f":"ItemE!$BK$17","v":0},{"$f":"ItemE!$BL$17","v":0},{"$f":"ItemF!$BK$17","v":0},{"$f":"ItemF!$BL$17","v":0},{"$f":"SUM(AV6:AV17)","v":0},{"$f":"SUM(AW9:AW14)","v":0}]
[null,null,null,null,null,null,null,null,null,null,null,null,null,null,null,null,null,null,null,null,null,null,null,null,null,null,null,null,null,null,null,null,null,null,null,{"$f":"IFERROR(AJ19*100/(SUM(AJ19:AK19)), 0)","v":0},{"$f":"IFERROR(AK19*100/(SUM(AJ19:AK19)), 0)","v":0},{"$f":"IFERROR(AL19*100/(SUM(AL19:AM19)), 0)","v":0},{"$f":"IFERROR(AM19*100/(SUM(AL19:AM19)), 0)","v":0},{"$f":"IFERROR(AN19*100/(SUM(AN19:AO19)), 0)","v":0},{"$f":"IFERROR(AO19*100/(SUM(AN19:AO19)), 0)","v":0},{"$f":"IFERROR(AP19*100/(SUM(AP19:AQ19)), 0)","v":0},{"$f":"IFERROR(AQ19*100/(SUM(AP19:AQ19)), 0)","v":0},{"$f":"IFERROR(AR19*100/(SUM(AR19:AS19)), 0)","v":0},{"$f":"IFERROR(AS19*100/(SUM(AR19:AS19)), 0)","v":0},{"$f":"IFERROR(AT19*100/(SUM(AT19:AU19)), 0)","v":0},{"$f":"IFERROR(AU19*100/(SUM(AT19:AU19)), 0)","v":0},{"$f":"IFERROR(AV19*100/(SUM(AV19:AW19)), 0)","v":0},{"$f":"IFERROR(AW19*100/(SUM(AV19:AW19)), 0)","v":0}]