WAZ0,WAZ6,WAZ12,WAZ18,WAZ24,WAZ30,WAZ36,HAZ0,HAZ6,HAZ12,HAZ18,HAZ24,HAZ30,HAZ36,WHZ0,WHZ6,WHZ12,WHZ18,WHZ24,WHZ30,WHZ36,gender,town,occup_m_s,occup_p_s,year_birth,ethnic,total_off,week_s,weaning_s,milk_s,other_s,edoc,macrosomic,dead_off,NB_dead_s,week,weaning,milk,other,age_moth_s,ethnic_s,total_off_s,dead_off_s,hij_vivos_2,educm,educp,occup_m,occup_p,escolaridadp,nivel_m_2,curso_m_2,escolaridadm,comuna,f_nac,p_obesos,imc_madre,dm2,d_gest,edadpadre,edadmadre,et1,et2,tabac,lact_insuf,dia_nac_2,mes_nac_2,tipo_parto_2,peso_nac_2,talla_nac_2,tallamadre,tallapadre,pesomadre,t_esperada,occup2,educ,occup,BAZ0,BAZ6,BAZ12,BAZ18,BAZ24,BAZ30,BAZ36,cbmi0,cbmi6,cbmi12,cbmi18,cbmi24,cbmi30,cbmi36,weight0,weight6,weight12,weight18,weight24,weight30,weight36,height0,height6,height12,height18,height24,height30,height36,mean_temp,bmi0,bmi6,bmi12,bmi18,bmi24,bmi30,bmi36,unif,id
-.36,-1.19,-.96,-.59,-.39,-.15,.28,-.08,-.11,-.6800000000000001,-.99,-1.39,-1.28,-.76,-.31,-1.46,-.89,-.18,.46,.73,.9400000000000001,2,5,0,2,2008,4,3,2,3,3,3,3,0,0,0,39,368,284,284,3,4,3,0,3,2,2,0,2,,2,4,,5 Talcahuano,39685,,,,,,,Ninguno,Ninguno,,,25,8,1,3.0699999,49,,,,,2,2,2,-.45,-1.54,-.8100000000000001,-.01,.65,.91,1.07,12.78633874736692,14.73004733078411,15.26594457182897,15.73312034779756,16.31555116532714,16.81108519085787,16.91792841654733,3.0699999,6.289206,7.9293518,9.4706144,10.874481,12.389324,14.263518,49,65.342514,72.070412,77.585693,81.640076,85.84716,91.820518,13.1,.0012786338,.0014730047,.0015265945,.001573312,.0016315551,.0016811085,.0016917929,.000044471351,1
.3,.44,0,-.26,-.73,-.89,-.37,.46,-1.14,-1.28,-1.52,-1.91,-1.96,-1.82,.06,1.57,.8200000000000001,.59,.38,.28,.89,2,4,0,2,2010,4,3,2,3,3,3,3,0,0,0,38,731,456,265,2,4,3,0,3,2,2,0,2,,2,4,,4 Quinta Normal,40211,,,,,,,Ninguno,Ninguno,,,2,2,1,3370,50,,,,,2,2,2,.12,1.46,1.01,.9,.66,.5,1.13,13.47999954223633,19.31477477310428,17.92654694206728,17.04415207880896,16.32096487483412,16.22142332558996,17.01143117749268,3.3699999,7.6697555,8.9144821,9.8580999,10.43638,11.302394,13.109208,50,63.015289,70.51796,76.051697,79.965385,83.471985,87.784492,14.6,.0013479999,.0019314775,.0017926547,.0017044152,.0016320965,.0016221424,.0017011431,.000067668036,2
-1.91,-.8100000000000001,-.98,-.64,-.53,-.5,-.42,-1.15,0,-.12,-.11,-.45,-.7000000000000001,-1.1,-1.61,-1.03,-1.28,-.8100000000000001,-.47,-.25,.23,2,7,0,1,2009,2,1,2,3,1,2,2,0,0,0,38,1096,69,165,2,2,1,0,1,2,2,0,1,3 MEDIO,2,4,,7 Puerto Montt,40143,,,,,26,,Ninguno,Mapuche,0,1,26,11,1,2430,47,,,,,1,2,1,-2.09,-1.12,-1.29,-.84,-.39,-.14,.38,11.00045299573202,15.2935872904594,14.65049107037393,14.66637351595049,14.91016497929594,15.35106574923167,15.91556067280829,2.4300001,6.5816059,7.9122252,9.4169626,10.691487,11.858965,13.04256,47,65.60112,73.489151,80.129799,84.679413,87.892967,90.525398,11.1,.0011000453,.0015293587,.0014650491,.0014666374,.0014910165,.0015351066,.0015915561,.00011030561,3
-.8200000000000001,-.7000000000000001,-.29,-.12,-.2,-.2,.12,-1.69,-.06,.51,.3,-.28,-.47,-.25,.9500000000000001,-.8300000000000001,-.72,-.38,-.15,-.02,.32,2,5,0,1,2007,4,1,2,1,1,2,2,0,0,0,37,18,64,204,1,4,1,0,1,2,1,0,1,,2,2,,5 Talcahuano,39258,,,1,0,,,Ninguno,Ninguno,,,25,6,1,2.8699999,46,,,,,1,2,1,.18,-.92,-.8200000000000001,-.44,-.07,.08,.36,13.56332649130001,15.56853805709143,15.24847732644955,15.15960763446182,15.32338706975067,15.63859175763411,15.89375923078268,2.8699999,6.6703138,8.6012325,10.023507,11.12463,12.30489,13.964573,46,65.455963,75.104698,81.314102,85.205063,88.703354,93.734726,13.1,.0013563327,.0015568538,.0015248477,.0015159608,.0015323387,.0015638592,.0015893759,.0001870268,4
.1,.29,-.18,-.3,-.6900000000000001,-1.07,-1.21,.59,-.58,-.6,-.8200000000000001,-1.32,-1.59,-1.82,-.47,.92,.12,.13,.01,-.33,-.33,1,4,0,2,2009,4,1,2,3,3,2,3,0,0,0,37,458,245,245,1,4,1,0,1,2,2,0,2,,2,4,,4 Quinta Normal,40036,,,,,,,Ninguno,Ninguno,,,11,8,1,3394,51,,,,,2,2,2,-.28,.84,.23,.28,.21,-.11,-.05,13.04882757941469,18.59760637080048,17.13646401774911,16.5218514698972,16.01116085100799,15.67693035977772,15.54960830285057,3.3940001,8.1587276,9.4168587,10.523204,11.162794,11.65606,12.323432,51,66.234261,74.12973,79.807671,83.497803,86.227417,89.023796,14.6,.0013048828,.0018597606,.0017136465,.0016521851,.001601116,.0015676931,.0015549609,.00028634584,5
.36,.66,.92,1.76,2.32,2.67,2.91,.99,.66,.6900000000000001,1.11,1.26,1.43,1.29,-.52,.47,.84,1.69,2.24,2.68,3.18,2,6,0,1,2009,2,1,2,2,1,2,2,0,0,0,39,153,67,186,1,2,1,0,1,1,2,0,1,4 MEDIO,1,8,8 BASICO,6 Tirua,39850,,,,,31,19,Mapuche,Ninguno,0,1,6,2,1,3400,51,,,,,1,2,1,-.22,.38,.74,1.6,2.27,2.68,3.19,13.0718957914934,17.50539001207724,17.4960977158574,18.17314597730144,18.94166061007708,19.78751337958646,20.66116691890355,3.4000001,7.8796206,9.991374,12.719997,15.398178,17.997635,20.490082,51,67.091385,75.56871,83.662041,90.162437,95.370071,99.585114,13,.0013071896,.0017505391,.0017496097,.0018173147,.0018941661,.0019787513,.0020661168,.00048373896,6
1.02,.98,.84,1.13,1.06,.87,.72,.85,.22,.13,.3,.06,-.12,-.48,.67,1.19,1.01,1.36,1.39,1.3,1.44,1,1,0,2,2009,4,2,2,3,3,2,3,0,0,0,40,201,199,199,2,4,2,0,2,2,2,0,2,4 MEDIO,2,4,4 MEDIO,1 Alto Hospicio,39862,,,,,26,26,Ninguno,Ninguno,1,0,18,2,1,3870,51,,,,,2,2,2,.87,1.12,1.04,1.32,1.47,1.34,1.49,14.59138424190435,19.03367606420088,18.30045125203908,17.99062600854014,17.7380326006035,17.61117018745259,17.6075509986159,3.8699999,8.7885151,10.530751,12.33881,13.644059,14.647224,15.549027,51.5,67.951088,75.857544,82.815857,87.703934,91.197632,93.972794,17.4,.0014591385,.0019033676,.0018300451,.0017990626,.0017738033,.001761117,.0017607551,.00070968969,7
.25,.48,.38,.38,.13,0,.26,.99,.62,.63,.31,-.22,-.32,-.11,-.6900000000000001,.25,.13,.31,.27,.15,.41,2,2,0,2,2008,5,2,2,2,3,3,3,0,0,0,40,186,261,261,2,4,2,0,2,2,2,0,2,,2,4,,2 Coquimbo,39488,,,1,0,,,Extranjero,Ninguno,,,10,2,1,3350,51,164,175,,163,2,2,2,-.38,.16,.02,.27,.35,.24,.44,12.87966130193221,17.15304034142379,16.41030318538677,16.1222336281073,15.89454165337029,15.85339276750515,15.99842133972773,3.3499999,7.6999998,9.333293,10.663563,11.596539,12.620193,14.222488,51,67,75.415245,81.327713,85.416191,89.221985,94.286438,15.1,.0012879662,.001715304,.0016410303,.0016122233,.0015894541,.0015853393,.0015998421,.00072051515,8
.53,.64,.9,1.31,1.37,1.27,1.17,.73,.04,.34,.3,-.07,-.26,-.49,.08,.89,1.01,1.6,1.86,1.88,1.99,2,7,0,2,2010,2,5,2,3,1,2,3,0,0,0,39,792,16,184,3,2,4,0,5,2,2,0,2,4 MEDIO,2,2,2 MEDIO,7 Puerto Montt,40331,,,,,37,39,Mapuche,Ninguno,0,1,2,6,1,3480,50,,,,,2,2,2,.25,.8200000000000001,.98,1.59,1.96,2.02,2.11,13.64572108253499,18.21086660265793,17.87851178051218,18.15674821213886,18.3935699858742,18.58481869380662,18.62455992747117,3.48,7.85637,9.9666882,11.999844,13.570003,14.859405,16.050282,50.5,65.681892,74.663742,81.295921,85.892838,89.417297,92.83213,11.1,.0013645721,.0018210866,.0017878512,.0018156748,.001839357,.0018584819,.001862456,.00075595058,9
.31,-.15,-.33,-.23,-.41,-.66,-.8,.59,-.6900000000000001,-1.08,-.92,-.96,-.86,-.9300000000000001,-.12,.42,.24,.29,.13,-.35,-.46,1,5,3,1,2010,4,2,2,2,2,3,4,0,0,0,38,184,122,261,2,4,2,0,2,2,2,3,1,,2,4,,5 Talcahuano,40260,,,,,,,Ninguno,Ninguno,,,23,3,1,3.5,51,,,,,3,2,3,.04,.34,.42,.47,.28,-.21,-.35,13.4563629373318,17.83746552095159,17.3955204143885,16.77703252695639,16.10418990244705,15.54807967494308,15.19439291189066,3.5,7.77,9.2646675,10.615602,11.530007,12.231736,12.944641,51,66,72.978714,79.545341,84.614609,88.696335,92.300346,13.1,.0013456363,.0017837465,.001739552,.0016777032,.001610419,.001554808,.0015194393,.001223607,10
.24,.33,.9,.89,.53,.31,.5700000000000001,.06,-.48,.16,-.06,-.6900000000000001,-.92,-.79,.45,.88,1.05,1.26,1.21,1.1,1.46,1,7,2,2,2010,2,3,2,3,1,2,2,0,0,0,38,577,15,212,3,2,3,0,3,1,1,2,2,8 BASICO,1,5,7 BASICO,7 Puerto Montt,40596,,,0,0,46,34,Mapuche,Ninguno,0,1,22,2,1,3465,50,,,,,2,1,2,.35,.8100000000000001,1.08,1.29,1.37,1.27,1.57,13.85999965667725,18.5454770853475,18.37009180425728,17.93788181248295,17.587032947801,17.49918060513463,17.72119534536851,3.4649999,8.1926985,10.592037,12.012067,12.836721,13.709887,15.27545,50,66.465225,75.933617,81.832024,85.434006,88.513206,92.843285,11.1,.001386,.0018545478,.0018370092,.0017937882,.0017587033,.0017499181,.0017721195,.0013427048,11
-.14,-.9300000000000001,-.72,-.39,-.36,-.45,-.45,.46,-1.01,-1.38,-1.23,-1.27,-1.23,-1.42,-.62,-.33,-.07,.24,.4,.28,.45,2,5,0,,2010,5,4,2,3,3,3,1,0,0,0,38,383,188,272,3,4,4,0,4,2,,0,,,2,2,,5 Talcahuano,40212,,,,,,,Ninguno,Extranjero,,,3,2,1,3.1700001,50,,,,,0,2,0,-.55,-.47,.11,.48,.58,.44,.64,12.68000030517578,16.19710031361713,16.54000076895917,16.41688873139103,16.21404636134767,16.13580111258512,16.27774380067397,3.1700001,6.4899998,8.1633101,9.7078342,10.907541,11.939364,12.980232,50,63.299999,70.253082,76.898125,82.019615,86.019188,89.298492,13.1,.001268,.00161971,.001654,.0016416889,.0016214047,.0016135802,.0016277743,.001467638,12
1.45,1.28,1.23,1.28,1.03,.78,.78,.73,.18,.67,.49,0,-.24,-.36,1.41,1.61,1.25,1.44,1.35,1.17,1.34,2,8,1,1,2010,4,1,2,2,1,2,2,0,0,0,38,186,65,248,2,4,1,0,1,2,2,1,1,,2,4,,8 Punta Arenas,40532,,,,,,,Ninguno,Ninguno,,,20,12,1,3940,52,,,,,1,2,1,1.58,1.57,1.17,1.4,1.44,1.29,1.44,15.44946596302503,19.51331496786042,18.1890724607899,17.84385377134864,17.52548506664589,17.39309445338023,17.49250165436046,3.9400001,8.5,10.377427,11.95682,12.993624,13.935691,15.230874,50.5,66,75.533493,81.858452,86.105347,89.51088,93.311775,6.4000001,.0015449466,.0019513315,.0018189072,.0017843854,.0017525485,.0017393094,.0017492502,.0015231697,13
1.13,2.46,2.24,1.79,1.1,.8200000000000001,1.39,1.65,.71,.8100000000000001,.84,.54,.46,.43,-.22,2.67,2.37,1.88,1.1,.8200000000000001,1.72,1,2,0,,2010,4,1,2,3,1,2,1,0,0,0,40,190,0,190,2,4,1,0,1,2,2,0,,,2,4,,2 Coquimbo,40314,,,,,,,Ninguno,Ninguno,,,16,5,1,3930,53,162,173,,174,0,2,0,.44,2.63,2.32,1.77,1.12,.75,1.64,13.99074427467854,21.63411088161072,20.41101516413289,18.68846476639653,17.23475783040096,16.77851805005338,17.82978124320698,3.9300001,10.3,12.250591,13.266943,13.695745,14.561183,16.887438,53,69,77.47226,84.255569,89.143616,93.158295,97.321518,15.1,.0013990744,.0021634111,.0020411015,.0018688465,.0017234758,.0016778518,.0017829781,.0015442502,14
.31,-.45,-.76,-.5,-.52,-.66,-.78,1.12,.27,-.25,-.14,-.32,-.42,-.72,-.8300000000000001,-.73,-.88,-.53,-.52,-.6900000000000001,-.59,1,7,0,1,2008,4,3,2,3,3,2,1,0,0,0,39,592,240,186,3,4,3,0,3,1,1,0,1,8 BASICO,1,8,8 BASICO,7 Puerto Montt,39592,,,0,0,42,36,Ninguno,Ninguno,0,0,24,5,1,3500,52,,,,,1,1,1,-.37,-.8,-.85,-.58,-.45,-.63,-.52,12.94378698224852,16.23456919483101,15.72894772281403,15.4545863858515,15.21072977190112,15.05275676246123,14.98350243091173,3.5,7.5192914,8.8381214,10.297923,11.389341,12.241054,12.98173,52,68.056259,74.960098,81.629311,86.531509,90.178162,93.080696,11.1,.0012943787,.0016234569,.0015728947,.0015454587,.0015210729,.0015052757,.0014983503,.0016127394,15
-1.8,-.7000000000000001,-.04,.43,.46,.32,.2,-1.15,-.48,-.07,.5600000000000001,.6800000000000001,.72,.46,-1.42,-.48,-.02,.21,.04,-.19,-.11,2,4,0,1,2010,4,4,2,1,2,3,2,0,0,0,38,0,143,260,3,4,4,0,4,2,1,0,1,,1,3,,4 Quinta Normal,40350,,,,,,,Ninguno,Ninguno,,,21,6,2,2470,47,,,,,1,2,1,-1.91,-.59,-.01,.14,.07,-.24,-.18,11.18153023363617,16.03269052651631,16.36568562440697,15.93562260101287,15.50374541988511,15.23307041463919,15.17703536623989,2.47,6.6700001,8.8697701,10.734303,12.08565,13.139836,14.112879,47,64.5,73.618858,82.073395,88.291054,92.875519,96.430481,14.6,.001118153,.001603269,.0016365686,.0015935623,.0015503746,.0015233071,.0015177035,.0019696197,16
1.56,1.62,1.62,1.59,1.21,.74,.46,1.53,1.99,2.28,2.3,1.85,1.5,1.11,.58,.87,.9500000000000001,.65,.26,-.15,-.24,2,8,0,3,2009,4,1,2,3,3,2,4,0,0,0,39,732,550,244,2,4,1,0,1,2,2,0,4,,2,4,,8 Punta Arenas,39926,,,,,,,Ninguno,Ninguno,,,23,4,1,3998,52,,,,,4,2,3,1.11,.72,.5600000000000001,.47,.2,-.29,-.37,14.78550261294348,18.05043187073034,17.21267718106485,16.41209190320081,15.68474810405572,15.16598625652614,14.92789419378706,3.9979999,8.8699999,10.918189,12.444541,13.288422,13.867759,14.600476,52,70.099998,79.643639,87.077805,92.044518,95.624199,98.897255,6.4000001,.0014785503,.0018050432,.0017212677,.0016412092,.0015684748,.0015165986,.0014927894,.0020228662,17
.11,-1.12,-.42,-.58,-.9,-.9400000000000001,-.36,.06,-1.52,-1.19,-1.02,-1.02,-.64,-.06,.24,-.18,.2,-.12,-.51,-.9300000000000001,-.48,1,4,2,3,2009,4,2,2,2,1,2,5,0,0,0,38,128,43,244,2,4,2,0,2,3,2,2,3,,3,2,,4 Quinta Normal,40037,,,,,,,Ninguno,Ninguno,,,12,8,1,3400,50,,,,,3,3,3,.15,-.3,.38,.07,-.38,-.85,-.54,13.60000038146973,16.91921313776409,17.34951103422993,16.25609427853599,15.29453652529764,14.80948136135315,14.96156875397469,3.4000001,6.9791031,9.1731701,10.210607,10.899278,11.845243,13.654564,50,64.22583,72.713676,79.253357,84.417152,89.433876,95.532326,14.6,.00136,.0016919213,.001734951,.0016256095,.0015294537,.0014809482,.0014961569,.0020853921,18
.67,.91,1.31,1.1,.8100000000000001,.98,1.89,.46,.67,1.36,1.04,.62,.96,2.13,.63,.78,1.01,.8200000000000001,.5700000000000001,.59,1.06,2,9,2,,2009,3,1,2,3,3,2,4,0,0,0,40,977,248,178,3,3,1,0,1,3,0,2,,,3,5,,9 Easter Island,40011,,,,,,,Rapanui,Ninguno,,,17,7,1,3550,50,,,,,2,3,2,.6800000000000001,.71,.78,.72,.62,.5600000000000001,.98,14.19999980926514,18.02653312088068,17.56363993852888,16.7791154509986,16.26833564484318,16.29468378591105,16.78914696754468,3.55,8.1195917,10.490334,11.682126,12.629047,14.31444,17.721643,50,67.11367,77.283607,83.440407,88.107674,93.726891,102.73956,20.700001,.00142,.0018026533,.001756364,.0016779115,.0016268336,.0016294684,.0016789146,.0021434531,19
.15,1.6,2.16,2.62,2.61,2.37,2.05,.46,1.94,2.89,3.15,2.78,2.38,1.82,-.17,.88,1.35,1.56,1.68,1.59,1.54,2,3,1,2,2009,2,5,2,1,1,3,3,0,0,0,37,63,35,802,4,2,4,0,5,2,2,1,2,,2,4,,3 Lo Prado,40050,,,,,,,Ninguno,Ninguno,,,25,8,1,3300,50,,,,,2,2,2,-.11,.73,.9,1.36,1.58,1.49,1.48,13.19999980926514,18.06477387565674,17.74721959031957,17.77080883918097,17.74015448066271,17.69684819435948,17.56448318180638,3.3,8.844451,11.702852,14.249643,16.02228,17.240973,18.125935,50,69.971176,81.204613,89.546455,95.034973,98.703583,101.58569,14.6,.0013199999,.0018064774,.001774722,.0017770809,.0017740155,.0017696848,.0017564483,.0021740608,20
.42,1.51,1.16,.92,.33,-.26,-.48,.46,-.11,-.14,-.32,-.74,-.96,-1.18,.25,2.11,1.62,1.45,.9500000000000001,.3,.2,2,7,0,2,2009,4,3,2,3,3,2,2,0,0,0,38,421,421,190,2,4,3,0,3,1,1,0,2,8 BASICO,1,7,7 BASICO,7 Puerto Montt,40162,,,,,35,25,Ninguno,Ninguno,0,0,15,12,1,3430,50,,,,,2,1,2,.31,2.1,1.69,1.53,1.09,.45,.35,13.72000026702881,20.48298522293129,19.08142984144997,18.0545526733818,16.95902988500076,16.15184339354238,15.88309287668584,3.4300001,8.743288,10.293462,11.414694,11.887531,12.222809,12.931358,50,65.334229,73.447205,79.513115,83.723106,86.991028,90.230743,11.1,.001372,.0020482985,.0019081429,.0018054553,.001695903,.0016151844,.0015883093,.0022696052,21
.78,.37,.54,.47,.12,-.16,-.06,.46,.58,.84,.35,-.32,-.4,.12,.78,.13,.23,.41,.32,-.02,-.23,2,3,0,2,2009,4,3,2,3,3,3,3,0,0,0,40,549,549,370,3,4,3,0,3,2,2,0,2,,2,4,,3 Lo Prado,40029,,,,,,,Ninguno,Ninguno,,,4,8,1,3600,50,,,,,2,2,2,.8300000000000001,.05,.09,.36,.42,.07,-.26,14.39999961853027,16.97636996366541,16.51023893304616,16.25392630472236,15.98296525072129,15.62887924280838,15.07615882105445,3.5999999,7.599185,9.5230942,10.782431,11.569805,12.36443,13.645518,50,66.905388,75.947304,81.447769,85.081345,88.945328,95.137047,14.6,.0014399999,.001697637,.0016510239,.0016253926,.0015982966,.0015628879,.0015076159,.0023070821,22
-1.15,-.79,-.9,-.33,-.16,-.18,-.25,-1.69,-.26,-.91,-.24,.05,.27,.14,.41,-.78,-.64,-.3,-.34,-.5700000000000001,-.53,2,3,2,2,2008,4,1,2,1,2,3,3,0,0,0,39,0,186,255,1,4,1,0,1,2,2,2,2,,2,4,,3 Lo Prado,39713,,,,,,,Ninguno,Ninguno,,,22,9,1,2730,47,,,,,2,2,2,-.36,-.88,-.52,-.29,-.29,-.59,-.58,12.90170141339077,15.6213015494262,15.65028317343792,15.36211465189047,15.03557393530116,14.79573304685452,14.67581789379337,2.73,6.5999999,7.9913135,9.7721395,11.186146,12.332653,13.310987,46,65,71.457527,79.757095,86.254196,91.297737,95.236618,14.6,.0012901701,.0015621302,.0015650283,.0015362115,.0015035574,.0014795733,.0014675818,.0024999306,23
1.08,-.09,.32,.5,.37,.25,.37,-1,.71,.88,.62,-.02,-.19,.11,2.96,-.58,-.07,.34,.49,.46,.47,1,2,0,,2009,4,4,2,1,1,2,1,0,0,1,40,18,0,184,2,4,4,0,3,2,,0,,,1,2,,2 Coquimbo,39999,,,,,,,Ninguno,Ninguno,,,5,7,1,3900,48,,,,,0,2,0,2.35,-.66,-.23,.21,.5700000000000001,.5,.4,16.92708374725448,16.42512113350426,16.51574204835067,16.43543504089862,16.47135189863299,16.4429845353615,16.11551911121415,3.9000001,7.8200002,9.9529781,11.506269,12.601316,13.609192,14.900964,48,69,77.629623,83.671326,87.46682,90.975792,96.157913,15.1,.0016927083,.0016425122,.0016515742,.0016435435,.0016471352,.0016442984,.001611552,.0026247583,24
1.74,1.27,1.56,1.8,1.71,1.46,1.18,.46,-.6,-.33,-.13,-.22,-.27,-.6,2.11,2.18,2.25,2.52,2.44,2.15,2.09,2,7,0,2,2010,4,1,2,3,1,3,3,1,0,0,40,252,92,252,1,4,1,0,1,2,2,0,2,3 MEDIO,2,4,,7 Puerto Montt,40240,,,,,18,,Ninguno,Ninguno,0,1,3,3,1,4090,50,,,,,2,2,2,2.19,2.14,2.37,2.58,2.55,2.29,2.23,16.36000061035156,20.57433331983081,20.33834982381924,19.94979271266123,19.46988854386978,19.07400018359678,18.8286052996737,4.0900002,8.4917269,10.82768,12.785086,14.200019,15.24128,16.077671,50,64.244377,72.964203,80.053925,85.400955,89.390182,92.406494,11.1,.0016360001,.0020574334,.002033835,.0019949793,.0019469889,.0019074,.0018828606,.0026340352,25
.37,-.97,-.73,-.67,-.86,-.97,-.79,.59,-1.16,-1.38,-1.33,-1.49,-1.46,-1.51,-.02,-.28,-.08,-.08,-.09,-.3,.03,1,2,0,1,2009,4,2,2,3,3,2,2,0,0,0,40,317,192,242,3,4,2,0,2,2,2,0,1,,2,4,,2 Coquimbo,39846,,,,,,,Ninguno,Ninguno,,,2,2,1,3530,51,,,,,1,2,1,.13,-.38,.12,.2,.13,-.09,.26,13.57170308108332,16.80473350208892,16.98884765563315,16.41406016843478,15.90634414024744,15.70189681008829,15.93487879687297,3.53,7.0999999,8.8745451,10.098472,10.957083,11.794531,12.954968,51,65,72.275497,78.43679,82.996979,86.669098,90.166206,15.1,.0013571703,.0016804733,.0016988848,.001641406,.0015906345,.0015701897,.0015934879,.0027528116,26
1.14,1.94,1.28,1.51,1.41,1.15,.88,1.53,.62,.19,.38,.3,.29,.03,-.03,2.14,1.6,1.82,1.64,1.31,1.2,2,9,0,2,2008,3,1,2,2,2,2,3,0,0,0,39,166,166,166,1,3,1,0,1,2,2,0,2,,2,1,,9 Easter Island,39456,,,,,,,Rapanui,Rapanui,,,9,1,1,3780,52,,,,,2,2,2,.51,2.12,1.61,1.8,1.73,1.38,1.24,13.97928983502134,20.53909616179285,18.94549310120557,18.51932562324583,17.99723696440538,17.53334732551122,17.18302589063713,3.78,9.2200003,10.455091,12.308856,13.647498,14.637072,15.443628,52,67,74.286682,81.526024,87.081039,91.368118,94.803604,20.700001,.001397929,.0020539097,.0018945494,.0018519326,.0017997237,.0017533348,.0017183026,.0030983307,27
.31,.37,1.15,1,.61,.44,.86,-.35,.9300000000000001,.9300000000000001,0,-1.02,-1.2,-.4,1.06,-.12,1.02,1.37,1.53,1.46,1.48,2,8,0,,2010,4,1,2,2,2,2,1,0,0,0,39,129,111,248,1,4,1,0,1,2,,0,,,2,4,,8 Punta Arenas,40547,,,,,,,Ninguno,Ninguno,,,4,1,1,3378,50,,,,,0,2,0,.8,-.21,.88,1.39,1.7,1.66,1.59,14.36071855024268,16.58197624373123,17.71390732045706,17.83436381860372,17.9390948790226,17.97632945207772,17.73077745483078,3.378,7.5999999,10.280819,11.540926,12.30946,13.34056,15.388362,48.5,67.699997,76.182755,80.443604,82.836021,86.146278,93.160606,6.4000001,.0014360718,.0016581976,.0017713908,.0017834364,.0017939095,.0017976329,.0017730778,.0033564912,28
1.46,.99,1.29,1.44,1.2,.97,1.05,1.65,-.6900000000000001,.22,.31,.1,.16,.33,.29,1.89,1.52,1.75,1.54,1.25,1.3,1,2,0,,2008,4,1,2,3,1,2,1,1,0,0,40,302,0,181,2,4,1,0,1,2,,0,,,2,4,,2 Coquimbo,39651,,,,,,,Ninguno,Ninguno,,,22,7,1,4110,53,165,157,,167.5,0,2,0,.9,1.83,1.55,1.72,1.62,1.24,1.22,14.63154194914348,20.2020206398872,19.10543508001589,18.60347305678397,17.96388698583739,17.46028149887079,17.21856916455696,4.1100001,8.8000002,11.050621,12.762917,13.85537,14.831061,16.193068,53,66,76.052742,82.828148,87.823128,92.163826,96.976395,15.1,.0014631542,.0020202021,.0019105435,.0018603473,.0017963886,.0017460282,.0017218569,.0034229055,29
.19,-.02,.33,.08,-.41,-.6800000000000001,-.33,-.08,-.04,.23,-.23,-.99,-1.31,-1.2,.55,.07,.29,.26,.13,.02,.44,2,5,0,2,2010,4,1,2,1,1,3,3,0,0,0,41,0,58,258,1,4,1,0,1,2,2,0,2,,2,2,,5 Talcahuano,40264,,,,,,,Ninguno,Ninguno,,,27,3,1,3.3199999,49,,,,,2,2,2,.39,-.01,.26,.3,.27,.18,.6,13.8275715670254,16.8837261024057,16.7578822904658,16.15907992798836,15.7750421231128,15.78147469871441,16.22847460602318,3.3199999,7.2437735,9.2775698,10.282566,10.845738,11.602324,13.187561,49,65.501053,74.40593,79.770523,82.917137,85.743004,90.145363,13.1,.0013827572,.0016883726,.0016757882,.001615908,.0015775042,.0015781475,.0016228475,.0037512896,30
.25,1.1,1.2,1.5,1.37,1.05,.74,.46,.53,1.11,1.41,1.27,1.15,.8100000000000001,-.01,1.14,.98,1.12,.89,.55,.4,2,3,0,3,2009,2,1,2,1,3,3,5,0,0,0,39,62,546,546,2,2,1,0,1,2,3,0,4,,2,4,,3 Lo Prado,40121,,,,,,,Ninguno,Ninguno,,,4,11,1,3350,50,,,,,4,3,3,.05,1.08,.8100000000000001,1,.9,.49,.33,13.39999961853027,18.64652932804471,17.6025144661257,17.20611201894428,16.6800885623909,16.20685625410104,15.84844593481969,3.3499999,8.3180799,10.342777,12.291986,13.569948,14.435081,15.145804,50,66.790169,76.653366,84.52198,90.196548,94.37571,97.758118,14.6,.00134,.001864653,.0017602515,.0017206112,.0016680089,.0016206857,.0015848445,.0038929519,31
-.3,-.63,.1,.63,.73,.62,.47,-.47,-.67,-.8100000000000001,-.37,-.33,-.28,-.5,.24,-.24,.62,1.1,1.22,1.07,1.1,1,4,0,1,2008,5,1,2,2,1,3,2,0,0,0,39,127,64,1081,2,4,1,0,1,2,2,0,1,,2,4,,4 Quinta Normal,39650,,,,,,,Extranjero,Ninguno,,,21,7,1,3200,49,,,,,1,2,1,-.06,-.32,.78,1.18,1.34,1.13,1.15,13.32778029022789,16.89382323880226,17.9124716381495,17.78188595602898,17.53931204117381,17.3118065294069,17.12209283422567,3.2,7.3697348,9.7122107,11.672199,13.130877,14.225647,15.093914,49,66.048347,73.634491,81.019104,86.524796,90.649376,93.890686,14.6,.001332778,.0016893824,.0017912472,.0017781886,.0017539312,.0017311807,.0017122093,.004060776,32
.44,2.03,2.25,2.38,2.1,1.66,1.29,-.08,-.07,-.41,-.66,-1.19,-1.46,-1.67,.9400000000000001,2.73,3.21,3.65,3.71,3.35,3.06,2,7,3,2,2009,2,2,2,3,3,2,5,0,0,0,39,765,397,212,3,2,2,0,2,3,3,3,2,4 MEDIO,3,3,SUPERIOR,7 Puerto Montt,40054,,,1,0,42,34,Ninguno,Mapuche,0,0,29,8,1,3440,49,,,,,3,3,3,.77,2.75,3.37,3.83,3.9,3.61,3.31,14.3273638368199,21.77501023223273,22.3540066441129,22.3866039018611,22.07502651068058,21.57175983023006,20.8928272892735,3.4400001,9.3248215,11.83234,13.806847,14.953601,15.661984,16.321379,49,65.439667,72.754128,78.533173,82.304253,85.208046,88.385254,11.1,.0014327364,.0021775011,.0022354007,.0022386604,.0022075027,.0021571759,.0020892827,.0040985923,33
1.08,-1.07,.71,1.28,1.47,1.47,1.44,.73,-.6800000000000001,-.8300000000000001,-.5,-.36,-.14,-.2,.89,-.8100000000000001,1.46,2.03,2.21,2.07,2.16,2,6,0,2,2007,4,2,2,3,3,3,3,0,0,0,39,834,504,255,2,4,2,0,2,2,1,0,2,8 BASICO,1,8,1 MEDIO,6 Tirua,39415,,,,,23,22,Ninguno,Ninguno,,,29,11,1,3750,50,,,,,2,2,2,1.05,-.9300000000000001,1.61,2.15,2.32,2.21,2.25,14.70444074110382,15.54804339446862,18.94935295270367,19.14264706203227,19.04514196185954,18.92015911990807,18.87635361128673,3.75,6.3800659,9.731348,11.946866,13.747639,15.271363,16.655743,50.5,64.058197,71.662064,78.999802,84.961456,89.8414,93.934029,13,.001470444,.0015548044,.0018949353,.0019142648,.0019045142,.0018920159,.0018876353,.0042655375,34
-.1,-.35,.3,.52,.54,.8,1.55,.59,.71,.65,.64,.34,.48,1.02,-.8,-.9300000000000001,.02,.35,.47,.78,1.47,1,3,0,2,2010,4,1,2,3,2,2,3,0,0,0,40,236,180,236,2,4,1,0,1,2,2,0,2,,2,4,,3 Lo Prado,40418,,,,,,,Ninguno,Ninguno,,,28,8,1,3300,51,,,,,2,2,2,-.58,-1.01,-.08,.22,.51,.7000000000000001,1.34,12.68742772901301,15.96303277595583,16.71006965681893,16.45014456107392,16.3913054022623,16.71684928772503,17.39439852821953,3.3,7.5999999,9.9311981,11.528486,12.848041,14.531222,17.219395,51,69,77.092422,83.714615,88.534325,93.233902,99.495682,14.6,.0012687427,.0015963033,.001671007,.0016450145,.0016391305,.0016716849,.0017394399,.0043095979,35